{"text_format":"1","workbook":"xlsx","n_sheets":15,"sheets":["Manuel d'utilisation","(Hydro)géologie","Granulométrie","Sol Wal DS TE ","AR Sol BOF_TRA & SRA","Sol Wal DS TV","Sol Wal RGPT","Eau Wal DS TE","AR Eau BOF_TRA & SRA","Eau Wal DS TV","Eau Wal RGPT","Air du sol","Sol Forages Contrôle IS","Eau Monitoring post-TA","Histlog"],"not_rendered":{"charts":2,"images":3,"macros":1,"external_links":2,"defined_names":29,"comments":0,"pivot_tables":0},"unopened":[],"bounds":{"document_bytes":16777216,"sheet_cells":100000,"rows_first":2000,"rows_last":500,"rows_between":2000,"halvings":0,"cell_chars":16384,"cell_head_chars":4096},"cells_cut":0,"cells_raw":0,"read":"whole","date_system":"1900"}

{"sheet":"Manuel d'utilisation","index":0,"n_rows":29,"n_cols":3,"rows_kept":29,"cut":false,"hidden":false,"merged":[[19,1,19,2],[1,1,1,2],[14,1,14,2],[15,1,15,2],[16,1,16,2],[17,1,17,2],[12,1,12,2]]}
[]
[null,"Données de base"]
[null,"Projet :",{"$f":"CONCATENATE(\"BOF_SL_\",C6,\": \",C7)","v":"BOF_SL_6000: Rue de la Station, 666 à 4308 Manage"}]
[]
[null,null,"Une fois complétés, les champs en jaune ci-dessous seront automatiquement importés dans les différents onglets"]
[null,"N° de dossier BOFAS",6000]
[null,"Adresse","Rue de la Station, 666 à 4308 Manage"]
[null,"Coordonnées X -Y"," x= …... ; y = …...    "]
[null,"Usage / affectation","IV"]
[null,"Teneur moy. en mat. org. (%)",3]
[null,"Teneur moyenne en argile (%)",7]
[]
[null,"Explications des tableaux standard"]
[]
[null,"Dans l'étude de sol, si d'application et pour autant qu'elles soient connues, les données doivent être reprises conformément aux tableaux standard présentés dans les onglets ci-après. L'EAAS ne peut s'écarter des tableaux standard qu'avec l'accord préalable de BOFAS. "]
[null,"Les différents onglets peuvent contenir certaines données pertinentes à reprendre tout au long du projet (EDS, PA, TA). Les différents onglets qui seront reportés (ou corrigés) à la phase suivante sont : l'(hydro)géologie, la granulométrie, les données des forages/piézomètres, les observations de terrain les plus importantes ainsi que les résultats d'analyses."]
[null,"Les analyses réalisées doivent être groupées par zone ou par source potentielle. Si elle est distincte de la pollution propre à la SS (TE = TankstationEIGEN = PROPRE à la SS), la pollution étrangère à la SS (TV = TankstationVREEMD = ETRANGER à la SS) sera reprise dans une zone séparée."]
[null,"Accompagnés des figures, les tableaux standard donnent une image claire de la situation actuelle en matière de contamination."]
[]
[null,"Rappels concernant les types d'usage en Wallonie"]
[]
[]
[null,"Types d'usage selon le Décret Sols (DS) en Wallonie"]
[]
[]
[]
[]
[]
[null,"Types d'usage selon l'Arrêté stations-service (RGPT) en Wallonie"]

{"sheet":"(Hydro)géologie","index":1,"n_rows":47,"n_cols":8,"rows_kept":47,"cut":false,"hidden":false,"merged":[[8,6,8,7],[6,5,6,7],[42,6,42,7],[43,6,43,7],[44,6,44,7],[9,6,9,7],[45,6,45,7],[46,6,46,7],[28,1,28,2],[1,1,1,7],[2,2,2,7],[15,2,15,4],[26,2,26,4],[4,1,4,2],[17,1,17,2],[19,6,19,7],[7,6,7,7],[14,6,14,7],[13,6,13,7],[12,6,12,7],[11,6,11,7],[10,6,10,7]]}
[]
[null,"(Hydro)géologie"]
[null,"Projet:",{"$f":"'Manuel d''utilisation'!C3","v":"BOF_SL_6000: Rue de la Station, 666 à 4308 Manage"}]
[]
[null,"Sur base du contexte géologique"]
[]
[null,"Profondeur (m-ns)","Stratigraphie","Lithologie","Eau souterraine","Valeur K sur base de la littérature \n(compléter une des deux colonnes)"]
[null,null,null,null,null,"m/s","m/j"]
[null,null,null,null,"aquifère exploitable",{"$f":"+IF(G9<>\"\",G9/(24*60*60),\"\")","v":""},{"$f":"+IF(F9<>\"\",F9*(24*60*60),\"\")","v":0}]
[null,null,null,null,"horizon discontinu non exploitable","",0]
[null,null,null,null,"eau de rétention","",0]
[null,null,null,null,"aquiclude","",0]
[null,null,null,null,"aquitard","",0]
[null,null,null,null,"aquifère non exploitable","",0]
[null,null,null,null,"etc…","",0]
[]
[]
[null,"Sur base des forages"]
[]
[null,"Profondeur (m-ns)","Texture, couleur, hétérogénéité","Remarques *","% matière organique","% argile","Valeur K calculée (voir onglet 'Granulométrie') (compléter une des deux colonnes)"]
[null,null,null,null,null,null,"m/s","m/j"]
[null,null,null,"glauconite",null,null,{"$f":"+IF(H22<>\"\",H22/(24*60*60),\"\")","v":""},{"$f":"+IF(G22<>\"\",G22*(24*60*60),\"\")","v":0}]
[null,null,null,"5 cm de tourbe",null,null,"",{"$f":"+IF(G23<>\"\",G23*(24*60*60),\"\")","v":0}]
[null,null,null,"venues d'eau importantes",null,null,"",0]
[null,null,null,"10 % de cailloux",null,null,"",0]
[null,null,null,null,null,null,"",0]
[null,null," * couche de tourbe, d'argile, de gravier, teneur élevée en glauconite, venues d'eau importantes, % de cailloux, ... ou toute autre couche remarquable qui perturbe la continuité du sous-sol"]
[]
[null,"Tableau récapitulatif (hydro)géologie"]
[]
[null,null,"Caractère vulnérable/exploitable"]
[null,null,"Zone de protection de captage (et type de zone)"]
[null,null,"Eaux de surface (distance - m)"]
[null,null,"Profondeur de la nappe (m-ns)"]
[null,null,"Direction d'écoulement des eaux souterraines"]
[null,null,"Topographie/aval/point bas"]
[null,null,"Distance par rapport aux eaux de surface"]
[null,null,"Captage important dans le cadre de l'EC/AR"]
[null,null,"Direction (N, NE, S, ..)","distance (m)","profondeur","débit (m3/j)"]
[]
[]
[]
[null,null,"Paquet 'épuration' : analyse sur…","piézo … (cm-ns)","piézo … (cm-ns)","piézo … (cm-ns)","piézo … cm-ns)"]
[null,null,"Fe (mg/l)"]
[null,null,"Mn (mg/l)"]
[null,null,"Ca (mg/l)"]
[null,null,"Mg (mg/l)"]

{"sheet":"Granulométrie","index":2,"n_rows":74,"n_cols":28,"rows_kept":74,"cut":false,"hidden":false,"merged":[[5,26,5,27],[32,25,32,27],[31,25,31,27],[30,25,30,27],[28,25,28,27],[29,25,29,27],[4,5,5,5],[4,18,4,20],[4,23,5,23],[4,2,6,2],[4,4,5,4],[33,25,33,27],[34,25,34,27],[1,1,1,27],[27,24,27,27],[3,5,3,14],[4,1,5,1],[4,15,4,17],[4,6,4,14],[4,3,5,3],[2,1,2,2],[2,3,2,27],[4,24,5,24],[4,25,4,27],[3,2,3,4],[3,15,3,20],[3,23,3,27]]}
[]
[null,"Granulométrie / triangle textural belge / perméabilité"]
[null,"Projet:",null,{"$f":"'Manuel d''utilisation'!C3","v":"BOF_SL_6000: Rue de la Station, 666 à 4308 Manage"}]
[null,null,"Forage / échantillon",null,null,"Rapport du laboratoire",null,null,null,null,null,null,null,null,null,"Calcul (sur base du rapport du laboratoire)",null,null,null,null,null,null,null,"Remarques"]
[null,"Code","Forage et profondeur (m-ns)\n (encoder du moins profond au plus profond)","Texture selon le log de forage","Fraction gravier\n(>2000 µm) estimée ou en %","% MS","Pourcentage cumulatif passant sur le tamis (en % de matière sèche (MS) ou en % de fraction minérale)",null,null,null,null,null,null,null,null,"Détermination de la texture",null,null,"Texture normalisée (sur base de 100% de fraction minerale)",null,null,null,null,"Remarques vis-à-vis du triangle textural belge","Texture","Permeabilité"]
[null,null,null,null,null,null,"< 2 µm","< 16 µm","< 50 µm","< 63 µm","< 125 µm","< 250 µm","< 500 µm","< 1000 µm","< 2000 µm","% \nfraction\nsable \n(50-2000 µm)","%\nfraction\nlimon \n(2-50 µm)","%\nfraction \nargile \n(<2 µm)","% fraction sable","%\nfraction \nlimon","% \nfraction \nargile","x","y",null,null,"Méthode de determination de la valeur K","Valeur K calculée \n(cfr. Directive)\n(compléter une des deux colonnes)"]
[null,null,null,null,null,null,null,null,null,null,null,null,null,null,null,null,null,null,null,null,null,null,null,null,null,null,"m/s","m/j"]
[null,"0",null,"reference fraction sable",null,null,0,0,0,100,100,100,100,100,100,{"$f":"O8-I8","v":100},{"$f":"I8-G8","v":0},{"$f":"G8","v":0},{"$f":"P8/(SUM($P8:$R8))*100","v":100},{"$f":"Q8/(SUM($P8:$R8))*100","v":0},0,{"$f":"(100-S8+T8)*0.5","v":0},{"$f":"(U8)","v":0},null,{"$f":"IF(AND($U8>=35,$T8<=55),\"U\",\nIF(AND($U8>=17.5,($T8+$S8/2)<=70),\"E\",\nIF(AND($S8<=15,($T8+$S8/2)>70),\"A\",\nIF(AND($S8>82.5,$U8<8),\"Z\",\nIF(AND($S8>67.5,$U8<17.5),\"S\",\nIF(AND($S8>50,$U8<12.5),\"P\",\"L\"))))))","v":"Z"}]
[null,"0",null,"reference fractionlimon",null,null,0,100,100,100,100,100,100,100,100,{"$f":"O9-I9","v":0},{"$f":"I9-G9","v":100},{"$f":"G9","v":0},0,100,0,{"$f":"(100-S9+T9)*0.5","v":100},{"$f":"(U9)*SIN(60*PI()/180)","v":0},null,{"$f":"IF(AND($U9>=35,$T9<=55),\"U\",\nIF(AND($U9>=17.5,($T9+$S9/2)<=70),\"E\",\nIF(AND($S9<=15,($T9+$S9/2)>70),\"A\",\nIF(AND($S9>82.5,$U9<8),\"Z\",\nIF(AND($S9>67.5,$U9<17.5),\"S\",\nIF(AND($S9>50,$U9<12.5),\"P\",\"L\"))))))","v":"A"}]
[null,"0",null,"reference fraction argile",null,null,100,100,100,100,100,100,100,100,100,{"$f":"O10-I10","v":0},0,{"$f":"G10","v":100},0,0,100,50,86.602540378443862,null,"U"]
[null,"a","H1 7,5 -8 ","exemple à supprimer","non",92,4.8,5.8,7.2,8,14,75,94,95,95,{"$f":"IF(ISTEXT(C11),O11-I11,\"\")","v":87.8},{"$f":"IF(ISTEXT(C11),I11-G11,\"\")","v":2.4000000000000004},{"$f":"IF(ISTEXT(C11),G11,\"\")","v":4.8},{"$f":"IF(ISTEXT(C11),+P11/(SUM($P11:$R11))*100,\"\")","v":92.421052631578945},{"$f":"IF(ISTEXT(C11),+Q11/(SUM($P11:$R11))*100,\"\")","v":2.5263157894736845},{"$f":"IF(ISTEXT(C11),+R11/(SUM($P11:$R11))*100,\"\")","v":5.0526315789473681},5.0526315789473699,4.3757073033319003,"% gravier trop elevé => G","Z","Kozeny",{"$f":"+IF(AB11<>\"\",AB11/(24*60*60),\"\")","v":""},{"$f":"+IF(AA11<>\"\",AA11*(24*60*60),\"\")","v":0}]
[null,"b","KB1 10-12","exemple à supprimer",20,94,6.3,8.5,12,12,18,79,79,100,100,{"$f":"IF(ISTEXT(C12),O12-I12,\"\")","v":88},{"$f":"IF(ISTEXT(C12),I12-G12,\"\")","v":5.7},{"$f":"IF(ISTEXT(C12),G12,\"\")","v":6.3},{"$f":"IF(ISTEXT(C12),+P12/(SUM($P12:$R12))*100,\"\")","v":88},{"$f":"IF(ISTEXT(C12),+Q12/(SUM($P12:$R12))*100,\"\")","v":5.7},{"$f":"IF(ISTEXT(C12),+R12/(SUM($P12:$R12))*100,\"\")","v":6.3},8.85,5.4559600438419631,"% gravier trop elevé => G","Z","Rawls","",0]
[null,"c","KB1 14-14,2","exemple à supprimer",null,70,30,30,67,68,70,76,97,100,100,33,37,30,33,37,30,52,25.980762113533157,"% ms trop bas","E",null,"",0]
[null,"d","KB1 16-16,5","exemple à supprimer",1,88,20,26,35.200000000000003,37.4,38,40,40,40,40,4.7999999999999972,15.200000000000003,20,11.999999999999993,38.000000000000007,50,63,43.301270189221931,null,"U",null,"",0]
[null,"e","B4 18-19","exemple à supprimer",10,95,15,20,35.200000000000003,37.4,57.6,60,60,60,60,24.799999999999997,20.200000000000003,15,41.333333333333329,33.666666666666671,25,46.166666666666671,21.650635094610966,null,"E",null,"",0]
[null,"f",null,null,null,null,null,null,null,null,null,null,null,null,null,"","","","","","",{"$f":"(100-S16+T16)*0.5","v":{"$error":"#VALUE!"}},{"$f":"(U16)*SIN(60*PI()/180)","v":{"$error":"#VALUE!"}},null,{"$error":"#VALUE!"},null,"",0]
[null,"g",null,null,null,null,null,null,null,null,null,null,null,null,null,"","","","","","",{"$error":"#VALUE!"},{"$error":"#VALUE!"},null,{"$error":"#VALUE!"},null,"",0]
[null,"h",null,null,null,null,null,null,null,null,null,null,null,null,null,"","","","","","",{"$error":"#VALUE!"},{"$error":"#VALUE!"},null,{"$error":"#VALUE!"},null,"",0]
[null,"i",null,null,null,null,null,null,null,null,null,null,null,null,null,"","","","","","",{"$error":"#VALUE!"},{"$error":"#VALUE!"},null,{"$error":"#VALUE!"},null,"",0]
[null,"j",null,null,null,null,null,null,null,null,null,null,null,null,null,"","","","","","",{"$error":"#VALUE!"},{"$error":"#VALUE!"},null,{"$error":"#VALUE!"},null,"",0]
[null,"k",null,null,null,null,null,null,null,null,null,null,null,null,null,"","","","","","",{"$error":"#VALUE!"},{"$error":"#VALUE!"},null,{"$error":"#VALUE!"},null,"",0]
[null,"l",null,null,null,null,null,null,null,null,null,null,null,null,null,"","","","","","",{"$error":"#VALUE!"},{"$error":"#VALUE!"},null,{"$error":"#VALUE!"},null,"",0]
[null,"m",null,null,null,null,null,null,null,null,null,null,null,null,null,"","","","","","",{"$error":"#VALUE!"},{"$error":"#VALUE!"},null,{"$error":"#VALUE!"},null,"",0]
[null,"n",null,null,null,null,null,null,null,null,null,null,null,null,null,"","","","","","",{"$error":"#VALUE!"},{"$error":"#VALUE!"},null,{"$error":"#VALUE!"},null,"",0]
[null,"o",null,null,null,null,null,null,null,null,null,null,null,null,null,"","","","","","",{"$error":"#VALUE!"},{"$error":"#VALUE!"},null,{"$error":"#VALUE!"},null,"",0]
[]
[]
[null,null,null,null,null,null,null,null,null,null,null,null,null,null,null,null,null,null,null,null,null,null,null,null,"Texture"]
[null,null,null,null,null,null,null,null,null,null,null,null,null,null,null,null,null,null,null,null,null,null,null,"argile lourde","U","argile>=35 et limon<=55"]
[null,null,null,null,null,null,null,null,null,null,null,null,null,null,null,null,null,null,null,null,null,null,null,"argile","E","argile>=17,5 et (limon+sable/2)<=70"]
[null,null,null,null,null,null,null,null,null,null,null,null,null,null,null,null,null,null,null,null,null,null,null,"limon","A","sable<=15 et (limon+sable/2)>70"]
[null,null,null,null,null,null,null,null,null,null,null,null,null,null,null,null,null,null,null,null,null,null,null,"limon sableux","L","le reste après ZSP et après A"]
[null,null,null,null,null,null,null,null,null,null,null,null,null,null,null,null,null,null,null,null,null,null,null,"limon sableux léger","P","sable>50 et argile<12,5"]
[null,null,null,null,null,null,null,null,null,null,null,null,null,null,null,null,null,null,null,null,null,null,null,"sable limoneux","S","sable>67,5 et argile<17,5"]
[null,null,null,null,null,null,null,null,null,null,null,null,null,null,null,null,null,null,null,null,null,null,null,"sable","Z","sable>82,5 et argile<8"]
[]
[]
[]
[]
[]
[]
[]
[]
[]
[]
[]
[]
[]
[]
[]
[]
[]
[]
[]
[]
[]
[]
[]
[]
[]
["Note"]
["GENERALITES",null,null,null,null,null,null,null,null,null,null,null,null,null,null,null,null,null,null,null,null,null,null,null,null,"Kozeny"]
["Lors de son interprétation, l'EAAS doit tenir compte des effets du prétraitement en laboratoire sur l'applicabilité du triangle textural.",null,null,null,null,null,null,null,null,null,null,null,null,null,null,null,null,null,null,null,null,null,null,null,null,"Rawls"]
[null,null,null,null,null,null,null,null,null,null,null,null,null,null,null,null,null,null,null,null,null,null,null,null,null,"Autre"]
["GRAVIER"]
["Les sols contenant plus de 5% de gravier (fraction >2000 µm) peuvent éventuellement recevoir le code \"G\" (gravier) ; à proprement parler, ils ne font toutefois pas partie du triangle textural."]
["A partir d'une teneur en gravier de 30%, l'applicabilité du triangle textural belge devient très problématique. "]
["Pour l'évaluation à l'aide de S-Risk, en cas de présence de gravier, la classification selon le triangle textural belge peut néanmoins être conservée à titre indicatif, puisque la fraction minérale (<2000 µm) est déterminante vis-à-vis du comportement du polluant. "]
["Pour l'évaluation à l'aide de S-Risk Wallonie, on peut considérer qu'il convient de maintenir le type de sol \"G\" (limon caillouteux), dès lors que la matrice sera souvent limoneuse."]
[]
["TOURBE"]
["La tourbe et les sols tourbeux sont souvent caractérisés par de faibles teneurs en matière sèche (MS) et des teneurs élevées en matière organique (MO) ; ils ne font pas non plus partie du triangle textural et obtiennent le code \"V\" (Veen = tourbe en néérlandais)."]
["Le triangle textural de la tourbe (Stiboka) permet de décider si le sol répond à la définition d'un \"sol minéral\", et si la classification selon le triangle textural belge peut être appliquée de manière pertinente."]
["En pratique, à partir d'une teneur en MO de 15 à 30%, l'interprétation sur base du triangle textural belge peut devenir problématique."]

{"sheet":"Sol Wal DS TE ","index":3,"n_rows":169,"n_cols":108,"rows_kept":169,"cut":false,"hidden":false,"merged":[[5,102,5,107],[3,17,3,60],[31,10,31,14],[32,10,32,14],[32,15,32,16],[26,15,26,16],[27,15,27,16],[28,15,28,16],[29,15,29,16],[30,15,30,16],[31,15,31,16],[26,10,26,14],[27,10,27,14],[4,64,4,107],[4,62,4,63],[4,15,5,15],[4,16,5,16],[5,17,5,18],[5,64,5,65],[32,7,32,9],[5,66,5,71],[5,55,5,60],[5,62,5,63],[5,41,5,54],[5,87,5,100],[5,72,5,85],[29,10,29,14],[30,10,30,14],[31,1,31,6],[31,7,31,9],[1,1,1,60],[2,2,2,60],[3,10,3,14],[29,7,29,9],[30,7,30,9],[5,19,5,24],[5,25,5,38],[3,2,3,5],[4,1,5,9],[4,10,5,14],[3,6,3,8],[4,17,4,60],[32,1,32,6],[30,1,30,6],[29,1,29,6],[7,8,7,9],[8,1,8,16],[19,1,19,16],[22,1,22,16],[7,15,7,16],[7,10,7,14],[28,1,28,6],[27,1,27,6],[26,1,26,6],[26,7,26,9],[27,7,27,9],[28,7,28,9],[28,10,28,14]]}
[]
[null,"Perceptions de chantier et comparaison des résultats d'analyse (DS) pour la partie fixe du sol "]
[null,"Projet:",{"$f":"'Manuel d''utilisation'!C3","v":"BOF_SL_6000: Rue de la Station, 666 à 4308 Manage"}]
[null,"Type usage DS",{"$f":"K8","v":"II"},null,null,null,"MO(%):",null,null,{"$f":"'Manuel d''utilisation'!C10","v":3},null,null,null,null,null,"<2µm (%):",{"$f":"'Manuel d''utilisation'!C11","v":7},{"$f":"'Manuel d''utilisation'!AU11","v":0}]
[null,"Identification du forage",null,null,null,null,null,null,null,null,"Caractéristiques organoleptiques",null,null,null,null,"Echantillon","MS","Résultats d'analyse en mg/kg ms",null,null,null,null,null,null,null,null,null,null,null,null,null,null,null,null,null,null,null,null,null,null,null,null,null,null,null,null,null,null,null,null,null,null,null,null,null,null,null,null,null,null,null,null,"Impact gravier",null,"Résultats d'analyse en mg/kg ms après réévaluation sur base du facteur correctif (gravier)"]
[null,null,null,null,null,null,null,null,null,null,null,null,null,null,null,null,null,"HM somme",null,"Hydrocarbures pétroliers\n(fractions globales/combinées)",null,null,null,null,null,"Hydrocarbures pétroliers\n(analyse 'split' aliphatique/aromatique)",null,null,null,null,null,null,null,null,null,null,null,null,null,null,null,"Hydrocarbures pétroliers\ncalculés sur base de la répartition standard diesel",null,null,null,null,null,null,null,null,null,null,null,null,null,"Hydrocarbures aromatiques non halogénés",null,null,null,null,null,null,"Facteur correctif",null,"HM\nsomme",null,"Hydrocarbures pétroliers\n(fractions globales/combinées)",null,null,null,null,null,"Hydrocarbures pétroliers\n(analyse 'split' aliphatique/aromatique)",null,null,null,null,null,null,null,null,null,null,null,null,null,null,"Hydrocarbures pétroliers\ncalculés sur base de la répartition standard diesel",null,null,null,null,null,null,null,null,null,null,null,null,null,null,"Hydrocarbures aromatiques non halogénés"]
[null,"Parcelle cadastrale","Code du forage","X (Lambert)","Y (Lambert)","Refus de forage(6)","Date du forage","Phase d'étude(6)","Terrain naturel (TN) / Remblai (R)(6)","Profondeur du forage \n(cm-ns)","Profondeur: de (cm-ns) \nà (cm-ns)","Caractérisation(1) (6)","Odeur/PID(2)","Couleur suspecte(6)","Test huile/eau(2)","Profondeur \nde l'échantillon (cm-ns)","Matière sèche (%)","Huile minérale \nEC 5-35","Huile minérale \nEC 10-40","Fraction\nEC 5-8","Fraction\nEC 8-10","Fraction\nEC 10-12","Fraction\nEC 12-16","Fraction\nEC 16-21","Fraction\nEC 21-35","Ali\nEC 5-6","Ali\nEC 6-8","Ali\nEC 8-10","Ali\nEC 10-12","Ali\nEC 12-16","Ali\nEC 16-21","Ali\nEC 21-35","Aro\nEC 6-7","Aro\nEC 7-8","Aro\nEC 8-10","Aro\nEC 10-12","Aro\nEC 12-16","Aro\nEC 16-21","Aro\nEC 21-35",null,"Nature TPH(7) (6)","Ali\nEC 5-6","Ali\nEC 6-8","Ali\nEC 8-10","Ali\nEC 10-12","Ali\nEC 12-16","Ali\nEC 16-21","Ali\nEC 21-35","Aro\nEC 6-7","Aro\nEC 7-8","Aro\nEC 8-10","Aro\nEC 10-12","Aro\nEC 12-16","Aro\nEC 16-21","Aro\nEC 21-35","Benzène","Toluène","Ethylbenzène","Xylènes (somme)","MTBE","Naphtalène",null,"Pourcentage de cailloux","Pourcentage de fractionsfines","Huile minérale \nEC 5-35","Huile minérale \nEC 10-40","Fraction\nEC 5-8","Fraction\nEC 8-10","Fraction\nEC 10-12","Fraction\nEC 12-16","Fraction\nEC 16-21","Fraction\nEC 21-35","Ali\nEC 5-6","Ali\nEC 6-8","Ali\nEC 8-10","Ali\nEC 10-12","Ali\nEC 12-16","Ali\nEC 16-21","Ali\nEC 21-35","Aro\nEC 6-7","Aro\nEC 7-8","Aro\nEC 8-10","Aro\nEC 10-12","Aro\nEC 12-16","Aro\nEC 16-21","Aro\nEC 21-35",null,"Ali\nEC 5-6","Ali\nEC 6-8","Ali\nEC 8-10","Ali\nEC 10-12","Ali\nEC 12-16","Ali\nEC 16-21","Ali\nEC 21-35","Aro\nEC 6-7","Aro\nEC 7-8","Aro\nEC 8-10","Aro\nEC 10-12","Aro\nEC 12-16","Aro\nEC 16-21","Aro\nEC 21-35",null,"Benzène","Toluène","Ethylbenzène","Xylènes (somme)","MTBE","Naphtalène"]
[null,"NORMES:  Concentrations en gras et rouge si dépassement de la norme",null,null,null,null,null,null,"usage DS(6)",null,"II",null,null,null,null,"VS(3)",null,{"$f":"INDEX(R$52:R$56,MATCH($K$8,$P$52:$P$56,0))","v":"-"},"-",6,21,75,75,650,650,"-","-","-","-","-","-","-","-","-","-","-","-","-","-",null,null,{"$f":"INDEX(AP$52:AP$56,MATCH($K$8,$P$52:$P$56,0))","v":"-"},"-","-","-","-","-","-","-","-","-","-","-","-","-",0.1,4,0.3,1,1.5,2.5,null,null,null,{"$f":"R8","v":"-"},"-",6,21,75,75,650,650,"-","-","-","-","-","-","-","-","-","-","-","-","-","-",null,{"$f":"AP8","v":"-"},"-","-","-","-","-","-","-","-","-","-","-","-","-",null,{"$f":"BD8","v":0.1},4,0.3,1,1.5,2.5]
[null,"Zone suspecte investiguée:"]
[null,"1076Z","C1",null,null,null,"28/12/2004","EO","R",420,"80-150","Ess","*",null,null,"80-100",0.95,100,100,null,null,null,null,null,null,"<12.5",100,1000,null,null,null,null,null,null,null,null,null,null,null,null,"DI",null,{"$f":"IF(($AO10<>\"DI\"),\"np\",IF($R10<>\"\",IFERROR(0.00098*($R10),\"<\"),IF($S10<>\"\",IFERROR(0.001002*($S10),\"<\"),\"\")))","v":9.8000000000000004E-2},{"$f":"IF(($AO10<>\"DI\"),\"np\",IF($R10<>\"\",IFERROR(0.00879*($R10),\"<\"),IF($S10<>\"\",IFERROR(0.00901804*($S10),\"<\"),\"\")))","v":0.87899999999999989},{"$f":"IF(($AO10<>\"DI\"),\"np\",IF($R10<>\"\",IFERROR(0.08203*($R10),\"<\"),IF($S10<>\"\",IFERROR(0.08416834*($S10),\"<\"),\"\")))","v":8.2030000000000012},{"$f":"IF(($AO10<>\"DI\"),\"np\",IF($R10<>\"\",IFERROR(0.47363*($R10),\"<\"),IF($S10<>\"\",IFERROR(0.4859719*($S10),\"<\"),\"\")))","v":47.363},{"$f":"IF(($AO10<>\"DI\"),\"np\",IF($R10<>\"\",IFERROR(0.22461*($R10),\"<\"),IF($S10<>\"\",IFERROR(0.2304609*($S10),\"<\"),\"\")))","v":22.461000000000002},null,null,null,{"$f":"IF(($AO10<>\"DI\"),\"np\",IF($R10<>\"\",IFERROR(0.01563*($R10),\"<\"),IF($S10<>\"\",IFERROR(0.01603206*($S10),\"<\"),\"\")))","v":1.5630000000000002},{"$f":"IF(($AO10<>\"DI\"),\"np\",IF($R10<>\"\",IFERROR(0.01367*($R10),\"<\"),IF($S10<>\"\",IFERROR(0.01402806*($S10),\"<\"),\"\")))","v":1.367},{"$f":"IF(($AO10<>\"DI\"),\"np\",IF($R10<>\"\",IFERROR(0.1123*($R10),\"<\"),IF($S10<>\"\",IFERROR(0.1152305*($S10),\"<\"),\"\")))","v":11.23},{"$f":"IF(($AO10<>\"DI\"),\"np\",IF($R10<>\"\",IFERROR(0.06836*($R10),\"<\"),IF($S10<>\"\",IFERROR(0.07014028*($S10),\"<\"),\"\")))","v":6.8360000000000003},null,0.55000000000000004,4.3,3,3.2,null,1,null,null,0.1,{"$f":"IFERROR($BL10*R10,\"<\")","v":10},{"$f":"IFERROR($BL10*S10,\"<\")","v":10},{"$f":"IFERROR($BL10*T10,\"<\")","v":0},{"$f":"IFERROR($BL10*U10,\"<\")","v":0},{"$f":"IFERROR($BL10*V10,\"<\")","v":0},{"$f":"IFERROR($BL10*W10,\"<\")","v":0},{"$f":"IFERROR($BL10*X10,\"<\")","v":0},{"$f":"IFERROR($BL10*Y10,\"<\")","v":0},{"$f":"IFERROR($BL10*Z10,\"<\")","v":"<"},{"$f":"IFERROR($BL10*AA10,\"<\")","v":10},{"$f":"IFERROR($BL10*AB10,\"<\")","v":100},{"$f":"IFERROR($BL10*AC10,\"<\")","v":0},{"$f":"IFERROR($BL10*AD10,\"<\")","v":0},{"$f":"IFERROR($BL10*AE10,\"<\")","v":0},{"$f":"IFERROR($BL10*AF10,\"<\")","v":0},{"$f":"IFERROR($BL10*AG10,\"<\")","v":0},{"$f":"IFERROR($BL10*AH10,\"<\")","v":0},{"$f":"IFERROR($BL10*AI10,\"<\")","v":0},{"$f":"IFERROR($BL10*AJ10,\"<\")","v":0},{"$f":"IFERROR($BL10*AK10,\"<\")","v":0},{"$f":"IFERROR($BL10*AL10,\"<\")","v":0},{"$f":"IFERROR($BL10*AM10,\"<\")","v":0},null,{"$f":"IFERROR($BL10*AP10,\"<\")","v":0},{"$f":"IF(($AO10=\"DI\"),IFERROR($BL10*AQ10,\"<\"),\"np\")","v":9.8000000000000014E-3},{"$f":"IF(($AO10=\"DI\"),IFERROR($BL10*AR10,\"<\"),\"np\")","v":8.7899999999999992E-2},{"$f":"IF(($AO10=\"DI\"),IFERROR($BL10*AS10,\"<\"),\"np\")","v":0.82030000000000014},{"$f":"IF(($AO10=\"DI\"),IFERROR($BL10*AT10,\"<\"),\"np\")","v":4.7363},{"$f":"IF(($AO10=\"DI\"),IFERROR($BL10*AU10,\"<\"),\"np\")","v":2.2461000000000002},{"$f":"$BL10*AV10","v":0},{"$f":"$BL10*AW10","v":0},{"$f":"$BL10*AX10","v":0},{"$f":"IF(($AO10=\"DI\"),IFERROR($BL10*AY10,\"<\"),\"np\")","v":0.15630000000000002},{"$f":"IF(($AO10=\"DI\"),IFERROR($BL10*AZ10,\"<\"),\"np\")","v":0.13670000000000002},{"$f":"IF(($AO10=\"DI\"),IFERROR($BL10*BA10,\"<\"),\"np\")","v":1.123},{"$f":"IF(($AO10=\"DI\"),IFERROR($BL10*BB10,\"<\"),\"np\")","v":0.6836000000000001},{"$f":"$BL10*BC10","v":0},null,{"$f":"IFERROR($BL10*BD10,\"<\")","v":5.5000000000000007E-2},{"$f":"IFERROR($BL10*BE10,\"<\")","v":0.43},{"$f":"IFERROR($BL10*BF10,\"<\")","v":0.30000000000000004},{"$f":"IFERROR($BL10*BG10,\"<\")","v":0.32000000000000006},{"$f":"IFERROR($BL10*BH10,\"<\")","v":0},{"$f":"IFERROR($BL10*BI10,\"<\")","v":0.1}]
[null,null,null,null,null,null,null,null,null,null,"200-250","Ess","**",null,null,"200-220",0.95,null,100,null,null,null,null,null,null,null,null,null,null,null,null,null,null,null,null,null,null,null,null,null,"DI",null,{"$f":"IF(($AO11<>\"DI\"),\"np\",IF($R11<>\"\",IFERROR(0.00098*($R11),\"<\"),IF($S11<>\"\",IFERROR(0.001002*($S11),\"<\"),\"\")))","v":0.10020000000000001},{"$f":"IF(($AO11<>\"DI\"),\"np\",IF($R11<>\"\",IFERROR(0.00879*($R11),\"<\"),IF($S11<>\"\",IFERROR(0.00901804*($S11),\"<\"),\"\")))","v":0.90180399999999994},{"$f":"IF(($AO11<>\"DI\"),\"np\",IF($R11<>\"\",IFERROR(0.08203*($R11),\"<\"),IF($S11<>\"\",IFERROR(0.08416834*($S11),\"<\"),\"\")))","v":8.4168339999999997},{"$f":"IF(($AO11<>\"DI\"),\"np\",IF($R11<>\"\",IFERROR(0.47363*($R11),\"<\"),IF($S11<>\"\",IFERROR(0.4859719*($S11),\"<\"),\"\")))","v":48.597189999999998},{"$f":"IF(($AO11<>\"DI\"),\"np\",IF($R11<>\"\",IFERROR(0.22461*($R11),\"<\"),IF($S11<>\"\",IFERROR(0.2304609*($S11),\"<\"),\"\")))","v":23.04609},null,null,null,{"$f":"IF(($AO11<>\"DI\"),\"np\",IF($R11<>\"\",IFERROR(0.01563*($R11),\"<\"),IF($S11<>\"\",IFERROR(0.01603206*($S11),\"<\"),\"\")))","v":1.6032060000000001},{"$f":"IF(($AO11<>\"DI\"),\"np\",IF($R11<>\"\",IFERROR(0.01367*($R11),\"<\"),IF($S11<>\"\",IFERROR(0.01402806*($S11),\"<\"),\"\")))","v":1.402806},{"$f":"IF(($AO11<>\"DI\"),\"np\",IF($R11<>\"\",IFERROR(0.1123*($R11),\"<\"),IF($S11<>\"\",IFERROR(0.1152305*($S11),\"<\"),\"\")))","v":11.52305},{"$f":"IF(($AO11<>\"DI\"),\"np\",IF($R11<>\"\",IFERROR(0.06836*($R11),\"<\"),IF($S11<>\"\",IFERROR(0.07014028*($S11),\"<\"),\"\")))","v":7.0140279999999997},null,2,10,20,300,null,2,null,null,0.2,0,20,0,0,0,0,0,0,0,0,0,0,0,0,0,0,0,0,0,0,0,0,null,0,2.0040000000000002E-2,0.18036079999999999,1.6833667999999999,9.7194380000000002,4.6092180000000003,0,0,0,0.32064120000000007,0.28056120000000001,2.3046099999999998,1.4028056,0,null,0.4,2,4,60,0,0.4]
[null,null,null,null,null,null,null,null,null,null,"250-400",null,null,null,null,"250-270",0.95,null,100,null,null,null,null,null,null,null,null,null,null,null,null,null,null,null,null,null,null,null,null,null,"autre ou ?",null,"np","np","np","np","np",null,null,null,"np","np","np","np",null,-0.2,-0.2,-0.2,-0.2,null,-0.2,null,null,0.2,0,20,0,0,0,0,0,0,0,0,0,0,0,0,0,0,0,0,0,0,0,0,null,0,"np","np","np","np","np",0,0,0,"np","np","np","np",0,null,-4.0000000000000008E-2,-4.0000000000000008E-2,-4.0000000000000008E-2,-4.0000000000000008E-2,0,-4.0000000000000008E-2]
[null,null,"C2",null,null,null,"2004-12-28","EO",null,350,null,null,null,null,null,null,null,null,100,null,null,null,null,null,null,null,null,null,null,null,null,null,null,null,null,null,null,null,null,null,"autre ou ?",null,"np","np","np","np","np",null,null,null,"np","np","np","np",null,null,null,null,null,null,null,null,null,0.2,0,20,0,0,0,0,0,0,0,0,0,0,0,0,0,0,0,0,0,0,0,0,null,0,"np","np","np","np","np",0,0,0,"np","np","np","np",0,null,0,0,0,0,0,0]
[null,"456f","p4",null,null,null,"2004-12-28","EO",null,400,"150-250","DI","*",null,"*",null,0.98,null,100,null,null,null,null,null,null,null,null,null,null,null,null,null,null,null,null,null,null,null,null,null,"DI",null,0.10020000000000001,0.90180399999999994,8.4168339999999997,48.597189999999998,23.04609,null,null,null,1.6032060000000001,1.402806,11.52305,7.0140279999999997,null,-0.05,-0.05,-0.05,-0.05,null,null,null,null,0.2,0,20,0,0,0,0,0,0,0,0,0,0,0,0,0,0,0,0,0,0,0,0,null,0,2.0040000000000002E-2,0.18036079999999999,1.6833667999999999,9.7194380000000002,4.6092180000000003,0,0,0,0.32064120000000007,0.28056120000000001,2.3046099999999998,1.4028056,0,null,-1.0000000000000002E-2,-1.0000000000000002E-2,-1.0000000000000002E-2,-1.0000000000000002E-2,0,0]
[null,null,null,null,null,null,null,null,null,null,"300-330",null,null,null,null,null,0.98,null,100,null,null,null,null,null,null,null,null,null,null,null,null,null,null,null,null,null,null,null,null,null,"DI",null,0.10020000000000001,0.90180399999999994,8.4168339999999997,48.597189999999998,23.04609,null,null,null,1.6032060000000001,1.402806,11.52305,7.0140279999999997,null,-0.05,-0.05,-0.05,-0.05,null,null,null,null,0.2,0,20,0,0,0,0,0,0,0,0,0,0,0,0,0,0,0,0,0,0,0,0,null,0,2.0040000000000002E-2,0.18036079999999999,1.6833667999999999,9.7194380000000002,4.6092180000000003,0,0,0,0.32064120000000007,0.28056120000000001,2.3046099999999998,1.4028056,0,null,-1.0000000000000002E-2,-1.0000000000000002E-2,-1.0000000000000002E-2,-1.0000000000000002E-2,0,0]
[null,"1076z","B1",null,null,null,"2019-07-28","EO","R",400,"200-250","Ess","**",null,null,"200-220",0.95,null,100,-12,300,400,50,-12,-12,null,null,null,null,null,null,null,null,null,null,null,null,null,null,null,"DI",null,0.10020000000000001,0.90180399999999994,8.4168339999999997,48.597189999999998,23.04609,null,null,null,1.6032060000000001,1.402806,11.52305,7.0140279999999997,null,0.7,10,20,300,null,0.5,null,null,0.2,0,20,-2.4000000000000004,60,80,10,-2.4000000000000004,-2.4000000000000004,0,0,0,0,0,0,0,0,0,0,0,0,0,0,null,0,2.0040000000000002E-2,0.18036079999999999,1.6833667999999999,9.7194380000000002,4.6092180000000003,0,0,0,0.32064120000000007,0.28056120000000001,2.3046099999999998,1.4028056,0,null,0.13999999999999999,2,4,60,0,0.1]
[null,null,null,null,null,null,null,null,null,null,null,null,null,null,null,null,null,null,null,null,null,null,null,null,null,null,null,null,null,null,null,null,null,null,null,null,null,null,null,null,"autre ou ?",null,"np","np","np","np","np",null,null,null,"np","np","np","np",null,null,null,null,null,null,null,null,null,0.2,0,0,0,0,0,0,0,0,0,0,0,0,0,0,0,0,0,0,0,0,0,0,null,0,"np","np","np","np","np",0,0,0,"np","np","np","np",0,null,0,0,0,0,0,0]
[null,null,null,null,null,null,null,null,null,null,null,null,null,null,null,null,null,null,null,null,null,null,null,null,null,null,null,null,null,null,null,null,null,null,null,null,null,null,null,null,"DI",null,"","","","","",null,null,null,"","","","",null,null,null,null,null,null,null,null,null,0.2,0,0,0,0,0,0,0,0,0,0,0,0,0,0,0,0,0,0,0,0,0,0,null,0,"<","<","<","<","<",0,0,0,"<","<","<","<",0,null,0,0,0,0,0,0]
[null,null,null,null,null,null,null,null,null,null,null,null,null,null,null,null,null,null,null,null,null,null,null,null,null,null,null,null,null,null,null,null,null,null,null,null,null,null,null,null,null,null,"np","np","np","np","np",null,null,null,"np","np","np","np",null,null,null,null,null,null,null,null,null,0.2,0,0,0,0,0,0,0,0,0,0,0,0,0,0,0,0,0,0,0,0,0,0,null,0,"np","np","np","np","np",0,0,0,"np","np","np","np",0,null,0,0,0,0,0,0]
[null,"Autre zone suspecte:"]
[null,null,null,null,null,null,null,null,null,null,null,null,null,null,null,null,null,null,100,null,null,null,null,null,null,null,null,null,null,null,null,null,null,null,null,null,null,null,null,null,"DI",null,0.10020000000000001,0.90180399999999994,8.4168339999999997,48.597189999999998,23.04609,null,null,null,1.6032060000000001,1.402806,11.52305,7.0140279999999997,null,null,null,null,null,null,null,null,null,0.5,{"$f":"IFERROR($BL21*R21,\"<\")","v":0},50,0,0,0,0,0,0,0,0,0,0,0,0,0,0,0,0,0,0,0,0,null,{"$f":"IFERROR($BL21*AP21,\"<\")","v":0},{"$f":"IF(($AO21=\"DI\"),IFERROR($BL21*AQ21,\"<\"),\"np\")","v":5.0100000000000006E-2},0.45090199999999997,4.2084169999999999,24.298594999999999,11.523045,{"$f":"$BL21*AV21","v":0},0,0,{"$f":"IF(($AO21=\"DI\"),IFERROR($BL21*AY21,\"<\"),\"np\")","v":0.80160300000000007},0.701403,5.7615249999999998,3.5070139999999999,{"$f":"$BL21*BC21","v":0},null,{"$f":"IFERROR($BL21*BD21,\"<\")","v":0},0,0,0,0,0]
[null,null,null,null,null,null,null,null,null,null,null,null,null,null,null,null,null,null,100,null,null,null,null,null,null,null,null,null,null,null,null,null,null,null,null,null,null,null,null,null,"DI",null,0.10020000000000001,0.90180399999999994,8.4168339999999997,48.597189999999998,23.04609,null,null,null,1.6032060000000001,1.402806,11.52305,7.0140279999999997,null,null,null,null,null,null,null,null,null,0.5,{"$f":"IFERROR($BL22*R22,\"<\")","v":0},{"$f":"IFERROR($BL22*S22,\"<\")","v":50},{"$f":"IFERROR($BL22*T22,\"<\")","v":0},{"$f":"IFERROR($BL22*U22,\"<\")","v":0},{"$f":"IFERROR($BL22*V22,\"<\")","v":0},{"$f":"IFERROR($BL22*W22,\"<\")","v":0},{"$f":"IFERROR($BL22*X22,\"<\")","v":0},{"$f":"IFERROR($BL22*Y22,\"<\")","v":0},{"$f":"IFERROR($BL22*Z22,\"<\")","v":0},{"$f":"IFERROR($BL22*AA22,\"<\")","v":0},{"$f":"IFERROR($BL22*AB22,\"<\")","v":0},{"$f":"IFERROR($BL22*AC22,\"<\")","v":0},{"$f":"IFERROR($BL22*AD22,\"<\")","v":0},{"$f":"IFERROR($BL22*AE22,\"<\")","v":0},{"$f":"IFERROR($BL22*AF22,\"<\")","v":0},{"$f":"IFERROR($BL22*AG22,\"<\")","v":0},{"$f":"IFERROR($BL22*AH22,\"<\")","v":0},{"$f":"IFERROR($BL22*AI22,\"<\")","v":0},{"$f":"IFERROR($BL22*AJ22,\"<\")","v":0},{"$f":"IFERROR($BL22*AK22,\"<\")","v":0},{"$f":"IFERROR($BL22*AL22,\"<\")","v":0},{"$f":"IFERROR($BL22*AM22,\"<\")","v":0},null,{"$f":"IFERROR($BL22*AP22,\"<\")","v":0},5.0100000000000006E-2,0.45090199999999997,4.2084169999999999,24.298594999999999,11.523045,0,0,0,0.80160300000000007,0.701403,5.7615249999999998,3.5070139999999999,{"$f":"$BL22*BC22","v":0},null,{"$f":"IFERROR($BL22*BD22,\"<\")","v":0},{"$f":"IFERROR($BL22*BE22,\"<\")","v":0},{"$f":"IFERROR($BL22*BF22,\"<\")","v":0},{"$f":"IFERROR($BL22*BG22,\"<\")","v":0},{"$f":"IFERROR($BL22*BH22,\"<\")","v":0},{"$f":"IFERROR($BL22*BI22,\"<\")","v":0}]
[null,"Autre zone suspecte:"]
[null,null,null,null,null,null,null,null,null,null,null,null,null,null,null,null,null,null,null,null,null,null,null,null,null,null,null,null,null,null,null,null,null,null,null,null,null,null,null,null,null,null,"np","np","np","np","np",null,null,null,"np","np","np","np",null,null,null,null,null,null,null,null,null,0.5,{"$f":"IFERROR($BL24*R24,\"<\")","v":0},0,0,0,0,0,0,null,{"$f":"IFERROR($BL24*Z24,\"<\")","v":0},0,0,0,0,0,0,0,0,0,0,0,0,0,null,{"$f":"IFERROR($BL24*AP24,\"<\")","v":0},{"$f":"IF(($AO24=\"DI\"),IFERROR($BL24*AQ24,\"<\"),\"np\")","v":"np"},"np","np","np","np",{"$f":"$BL24*AV24","v":0},0,0,{"$f":"IF(($AO24=\"DI\"),IFERROR($BL24*AY24,\"<\"),\"np\")","v":"np"},"np","np","np",{"$f":"$BL24*BC24","v":0},null,{"$f":"IFERROR($BL24*BD24,\"<\")","v":0},0,0,0,0,0]
[null,null,null,null,null,null,null,null,null,null,null,null,null,null,null,null,null,null,null,null,null,null,null,null,null,null,null,null,null,null,null,null,null,null,null,null,null,null,null,null,null,null,"np","np","np","np","np",null,null,null,"np","np","np","np",null,null,null,null,null,null,null,null,null,0.5,{"$f":"IFERROR($BL25*R25,\"<\")","v":0},{"$f":"IFERROR($BL25*S25,\"<\")","v":0},{"$f":"IFERROR($BL25*T25,\"<\")","v":0},{"$f":"IFERROR($BL25*U25,\"<\")","v":0},{"$f":"IFERROR($BL25*V25,\"<\")","v":0},{"$f":"IFERROR($BL25*W25,\"<\")","v":0},{"$f":"IFERROR($BL25*X25,\"<\")","v":0},null,{"$f":"IFERROR($BL25*Z25,\"<\")","v":0},{"$f":"IFERROR($BL25*AA25,\"<\")","v":0},{"$f":"IFERROR($BL25*AB25,\"<\")","v":0},{"$f":"IFERROR($BL25*AC25,\"<\")","v":0},{"$f":"IFERROR($BL25*AD25,\"<\")","v":0},{"$f":"IFERROR($BL25*AE25,\"<\")","v":0},{"$f":"IFERROR($BL25*AF25,\"<\")","v":0},{"$f":"IFERROR($BL25*AG25,\"<\")","v":0},{"$f":"IFERROR($BL25*AH25,\"<\")","v":0},{"$f":"IFERROR($BL25*AI25,\"<\")","v":0},{"$f":"IFERROR($BL25*AJ25,\"<\")","v":0},{"$f":"IFERROR($BL25*AK25,\"<\")","v":0},{"$f":"IFERROR($BL25*AL25,\"<\")","v":0},{"$f":"IFERROR($BL25*AM25,\"<\")","v":0},null,{"$f":"IFERROR($BL25*AP25,\"<\")","v":0},"np","np","np","np","np",0,0,0,"np","np","np","np",{"$f":"$BL25*BC25","v":0},null,{"$f":"IFERROR($BL25*BD25,\"<\")","v":0},{"$f":"IFERROR($BL25*BE25,\"<\")","v":0},{"$f":"IFERROR($BL25*BF25,\"<\")","v":0},{"$f":"IFERROR($BL25*BG25,\"<\")","v":0},{"$f":"IFERROR($BL25*BH25,\"<\")","v":0},{"$f":"IFERROR($BL25*BI25,\"<\")","v":0}]
[null,"Légende",null,null,null,null,null,null,null,null,null,null,null,null,null,null,null,null,null,null,null,null,null,null,null,null,null,null,null,null,null,null,null,null,null,null,null,null,null,null,null,null,null,null,null,null,null,null,null,null,null,null,null,null,null,null,null,null,null,null,null,null,null,null,null,null,null,null,null,null,null,null,null,null,null,null,null,null,null,null,null,null,null,null,null,null,null,null,null,null,null,null,null,null,null,null,null,null,null,null,null,null,{"$f":"$BL26*BD26","v":0},0,0,0,0,0]
[null,null,null,null,null,null,null,"usage DS(6)",null,null,"IV",null,null,null,null,"VSH(3)",null,{"$f":"INDEX(R$61:R$65,MATCH($K$27,$P$61:$P$65,0))","v":"-"},"-",6,1330.42,34559.43,34592.86,48464.75,48464.75,411.7,"-",50010,50150,50170,"-","-",0.7,125,406.7,20030,20060,15050,15050,null,"\"(7)\"",{"$f":"Z27","v":411.7},"-",50010,50150,50170,"-","-",0.7,125,406.7,20030,20060,15050,15050,{"$f":"INDEX(BD$61:BD$65,MATCH($K$27,$P$61:$P$65,0))","v":0.7},125,3.21,74.94,43.48,29.56,null,null,null,null,null,{"$f":"T27","v":6},1330.42,34559.43,34592.86,48464.75,48464.75,{"$f":"Z27","v":411.7},"-",50010,50150,50170,"-","-",0.7,125,406.7,20030,20060,15050,15050,null,{"$f":"BU27","v":411.7},{"$f":"BV27","v":"-"},50010,50150,50170,"-","-",0.7,125,406.7,20030,20060,15050,15050,null,{"$f":"BD27","v":0.7},125,3.21,74.94,43.48,29.56]
[null,null,null,null,null,null,null,"usage DS(6)",null,null,"III",null,null,null,null,"VSN(3)",null,{"$f":"INDEX(R$125:R$129,MATCH($K$28,$P$125:$P$129,0))","v":"-"},"-",6,149,577,5393,302208,1000000,"-","-","-","-","-","-","-","-","-","-","-","-","-","-",null,null,{"$f":"INDEX(AP$125:AP$129,MATCH($K$28,$P$125:$P$129,0))","v":"-"},"-","-","-","-","-","-","-","-","-","-","-","-","-",0.2,7.1,6,7.9,1.5,2.5,null,null,null,null,null,6,149,577,5393,302208,1000000,"-","-","-","-","-","-","-","-","-","-","-","-","-","-",null,"-",{"$f":"BV28","v":"-"},"-","-","-","-","-","-","-","-","-","-","-","-",null,0.2,7.1,6,7.9,1.5,2.5]
[null,null,null,null,null,null,null,null,null,null,null,null,null,null,null,"VSN-aj(3) (5)",null,null,null,null,null,null,null,null,null,null,null,null,null,null,null,null,null,null,null,null,null,null,null,null,null,{"$f":"Z29","v":0},0,0,0,0,0,0,0,0,0,0,0,0,0,null,null,null,null,null,null,null,null,null,null,null,0,0,0,0,0,0,0,0,0,0,0,0,0,0,0,0,0,0,0,0,null,0,{"$f":"BV29","v":0},0,0,0,0,0,0,0,0,0,0,0,0,null,0,0,0,0,0,0]
[null,null,null,null,null,null,null,"usage DS(6)",null,null,"III",null,null,null,null,"VLN(3)",null,{"$f":"INDEX(R$135:R$139,MATCH($K$30,$P$135:$P$139,0))","v":"-"},"-",12,298,1154,10786,604416,1000000,"-","-","-","-","-","-","-","-","-","-","-","-","-","-",null,null,{"$f":"INDEX(AP$135:AP$139,MATCH($K$30,$P$135:$P$139,0))","v":"-"},"-","-","-","-","-","-","-","-","-","-","-","-","-",1,59,30,34,6.18,17,null,null,null,null,null,12,298,1154,10786,604416,1000000,"-","-","-","-","-","-","-","-","-","-","-","-","-","-",null,"-","-","-","-","-","-","-","-","-","-","-","-","-","-",null,1,59,30,34,6.18,17]
[null,null,null,null,null,null,null,null,null,null,null,null,null,null,null,"VLN-aj(3) (5)",null,null,null,null,null,null,null,null,null,null,null,null,null,null,null,null,null,null,null,null,null,null,null,null,null,{"$f":"Z31","v":0},0,0,0,0,0,0,0,0,0,0,0,0,0,null,null,null,null,null,null,null,null,null,null,null,0,0,0,0,0,0,0,0,0,0,0,0,0,0,0,0,0,0,0,0,null,0,0,0,0,0,0,0,0,0,0,0,0,0,0,null,0,0,0,0,0,0]
[null,null,null,null,null,null,null,"MCS applicable (6)",null,null,"LIMON MCS-1",null,null,null,null,"BOF-SRA(3)",null,{"$f":"INDEX(R$85:R$119,MATCH($K$32,$P$85:$P$119,0))","v":4000},{"$f":"INDEX(S$85:S$119,MATCH($K$32,$P$85:$P$119,0))","v":3900},null,{"$f":"INDEX(U$85:U$119,MATCH($K$32,$P$85:$P$119,0))","v":100},{"$f":"INDEX(V$85:V$119,MATCH($K$32,$P$85:$P$119,0))","v":390},null,null,null,{"$f":"INDEX(Z$85:Z$119,MATCH($K$32,$P$85:$P$119,0))","v":"-"},4,36,336,1940,920,"-","-","-",64,56,460,280,"-",null,"\"(7)\"","-",4,36,336,1940,920,"-","-","-",64,56,460,280,"-",{"$f":"INDEX(BD$85:BD$119,MATCH($K$32,$P$85:$P$119,0))","v":0.16200000000000001},19,0.7,11.1,10,6,null,null,null,{"$f":"R32","v":4000},{"$f":"S32","v":3900},0,100,390,0,0,0,"-",4,36,336,1940,920,"-","-","-",64,56,460,280,"-",null,"-",4,36,336,1940,920,"-","-","-",64,56,460,280,"-",null,0.16200000000000001,19,0.7,11.1,10,6]
[null,null,null,null,null,null,null,"usage DS(6)",null,null,"III",null,null,null,null,"VSE(3)",null,{"$f":"INDEX(R$75:R$77,MATCH($K$33,$P$75:$P$77,0))","v":"-"},"-",105,105,75,75,650,650,"-","-","-","-","-","-","-","-","-","-","-","-","-","-",null,null,{"$f":"INDEX(AP$75:AP$77,MATCH($K$33,$P$75:$P$77,0))","v":"-"},"-","-","-","-","-","-","-","-","-","-","-","-","-",14,8.5,12,2,8,7.2,null,null,null,null,null,105,105,75,75,650,650,"-","-","-","-","-","-","-","-","-","-","-","-","-","-",null,"-","-","-","-","-","-","-","-","-","-","-","-","-","-",null,14,8.5,12,2,8,7.2]
[null,"(1) ESS = essence; DI = diesel; HA = hydrocarbures aromatiques ; MC = mazout de chauffage ; AU = autre"]
[null,"(2) Blanc (vide) = néant ; * = léger ; ** = moyen ; *** = fort ou valeur PID mesurée - il n'est pas nécessaire d'indiquer en même temps les perceptions organoleptiques et la réaction huile/eau qui n'est pas strictement nécessaire"]
[null,"(3) A adapter conformément à la législation et aux paramètres spécifiques au site"]
[null,"(4) Voir le GRER (partie D) pour l'applicabilité et les dérogations"]
[null,"(5) A calculer selon le GRER (partie C - annexe C2)"]
[null,"(6) Liste déroulante"]
[null,"(7) Dans le cas de diesel (\"DI\"), il convient de procéder à l'évaluation (vis-a-vis des VSH ou du BOF_SRA) sur base de la \"répartition standard diesel\" ; dans les autres cas (polluant autre que \"DI\"), il n'y a pas lieu de procéder à cette évaluation"]
[null,null,null,null,null,null,null,null,null,null,null,null,null,null,null,null,null,null,null,null,null,null,null,null,null,null,null,null,null,null,null,null,null,null,null,null,null,null,null,null,"DI"]
[null,null,null,null,null,null,null,"EO","TN",null,null,"Ess",null,"oui",null,null,null,null,null,null,null,null,null,null,null,null,null,null,null,null,null,null,null,null,null,null,null,null,null,null,"autre ou ?"]
[null,null,null,null,null,"Oui",null,"EC","R",null,null,"DI",null,"non"]
[null,null,null,null,null,null,null,"PA","non défini",null,null,"HA"]
[null,null,null,null,null,null,null,"EF",null,null,null,"MC"]
[null,null,null,null,null,null,null,"MON",null,null,null,"AU"]
[null,null,null,null,null,null,null,"EI"]
[null,null,null,null,null,null,null,"autre/non défini"]
[]
[null,null,null,null,null,null,null,null,null,null,null,null,null,null,"VS (DS)","usage",null,"conc. en mg/kg ms"]
[null,null,null,null,null,null,null,null,null,null,null,null,null,null,null,null,null,"Huile minérale \nEC5-35","Huile minérale \nEC10-40","Fraction\nEC 5-8","Fraction\nEC >8-10","Fraction\nEC >10-12","Fraction\nEC >12-16","Fraction\nEC >16-21","Fraction\nEC >21-35","ALI\nEC 5-6","ALI\nEC >6-8","ALI\nEC >8-10","ALI\nEC >10-12","ALI\nEC >12-16","ALI\nEC >16-21","ALI\nEC >21-35","Arom\nEC 6-7","Arom\nEC >7-8","Arom\nEC >8-10","Arom\nEC >10-12","Arom\nEC >12-16","Arom\nEC >16-21","Arom\nEC >21-35",null,null,"ALI\nEC 5-6","ALI\nEC >6-8","ALI\nEC >8-10","ALI\nEC >10-12","ALI\nEC >12-16","ALI\nEC >16-21","ALI\nEC >21-35","Arom\nEC 6-7","Arom\nEC >7-8","Arom\nEC >8-10","Arom\nEC >10-12","Arom\nEC >12-16","Arom\nEC >16-21","Arom\nEC >21-35","Benzène","Toluène","Ethylbenzène","Xylènes (somme)","MTBE","Naphtalène"]
[null,null,null,null,null,null,null,null,null,null,null,null,null,null,null,"I",null,"-","-",6,21,75,75,650,650,"-","-","-","-","-","-","-","-","-","-","-","-","-","-",null,null,{"$f":"Z52","v":"-"},{"$f":"AA52","v":"-"},"-","-","-","-","-","-","-","-","-","-","-","-",0.1,4,0.3,1,1.5,2.5]
[null,null,null,null,null,null,null,null,null,null,null,null,null,null,null,"II",null,"-","-",6,21,75,75,650,650,"-","-","-","-","-","-","-","-","-","-","-","-","-","-",null,null,{"$f":"Z53","v":"-"},"-","-","-","-","-","-","-","-","-","-","-","-","-",0.1,4,0.3,1,1.5,2.5]
[null,null,null,null,null,null,null,null,null,null,null,null,null,null,null,"III",null,"-","-",6,21,75,75,650,650,"-","-","-","-","-","-","-","-","-","-","-","-","-","-",null,null,{"$f":"Z54","v":"-"},"-","-","-","-","-","-","-","-","-","-","-","-","-",0.1,7,0.3,2,1.5,2.5]
[null,null,null,null,null,null,null,null,null,null,null,null,null,null,null,"IV",null,"-","-",6,150,580,750,1250,2100,"-","-","-","-","-","-","-","-","-","-","-","-","-","-",null,null,{"$f":"Z55","v":"-"},"-","-","-","-","-","-","-","-","-","-","-","-","-",0.2,7,3,8,1.5,2.5]
[null,null,null,null,null,null,null,null,null,null,null,null,null,null,null,"V",null,"-","-",9,600,600,920,2700,5300,"-","-","-","-","-","-","-","-","-","-","-","-","-","-",null,null,{"$f":"Z56","v":"-"},"-","-","-","-","-","-","-","-","-","-","-","-","-",0.2,22,3,30,2,6.3]
[]
[]
[null,null,null,null,null,null,null,null,null,null,null,null,null,null,"VSH (GRER04)","usage",null,"conc. en mg/kg ms"]
[null,null,null,null,null,null,null,null,null,null,null,null,null,null,null,null,null,"Huile minérale \nEC5-35","Huile minérale \nEC10-40","Fraction\nEC 5-8","Fraction\nEC >8-10","Fraction\nEC >10-12","Fraction\nEC >12-16","Fraction\nEC >16-21","Fraction\nEC >21-35","ALI\nEC 5-6","ALI\nEC >6-8","ALI\nEC >8-10","ALI\nEC >10-12","ALI\nEC >12-16","ALI\nEC >16-21","ALI\nEC >21-35","Arom\nEC 6-7","Arom\nEC >7-8","Arom\nEC >8-10","Arom\nEC >10-12","Arom\nEC >12-16","Arom\nEC >16-21","Arom\nEC >21-35",null,null,"ALI\nEC 5-6","ALI\nEC >6-8","ALI\nEC >8-10","ALI\nEC >10-12","ALI\nEC >12-16","ALI\nEC >16-21","ALI\nEC >21-35","Arom\nEC 6-7","Arom\nEC >7-8","Arom\nEC >8-10","Arom\nEC >10-12","Arom\nEC >12-16","Arom\nEC >16-21","Arom\nEC >21-35","Benzène","Toluène","Ethylbenzène","Xylènes (somme)","MTBE","Naphtalène"]
[null,null,null,null,null,null,null,null,null,null,null,null,null,null,null,"I",null,"-","-",953.96,38941.65,34559.43,34592.86,48464.75,48464.75,"-","-",50010,50150,50170,"-","-",143.6,50050,25680,20030,20060,15050,15050,null,null,{"$f":"Z61","v":"-"},{"$f":"AA61","v":"-"},{"$f":"AB61","v":50010},{"$f":"AC61","v":50150},{"$f":"AD61","v":50170},{"$f":"AE61","v":"-"},{"$f":"AF61","v":"-"},{"$f":"AG61","v":143.6},{"$f":"AH61","v":50050},{"$f":"AI61","v":25680},{"$f":"AJ61","v":20030},{"$f":"AK61","v":20060},{"$f":"AL61","v":15050},{"$f":"AM61","v":15050},143.6,50050,1930,125600,7378,278100]
[null,null,null,null,null,null,null,null,null,null,null,null,null,null,null,"II",null,"-","-",6,24,111.69,1002.14,7890.64,5538.72,36.31,90.83,21.78,111.6,8191,178000,9753,0.1,9.16,29.86,111.9,328.8,2443,2758,null,null,36.31,90.83,21.78,111.6,8191,178000,9753,0.1,9.16,29.86,111.9,328.8,2443,2758,0.1,9.16,0.32,6.36,1.51,3.72]
[null,null,null,null,null,null,null,null,null,null,null,null,null,null,null,"III",null,"-","-",6,24.03,116.43,1726.81,8582.4,9369.0300000000007,36.340000000000003,90.87,21.8,111.8,8757,194000,194100,0.1,9.75,31.57,128.9,601,2657,2909,null,null,36.340000000000003,90.87,21.8,111.8,8757,194000,194100,0.1,9.75,31.57,128.9,601,2657,2909,0.1,9.75,0.35,6.45,2.2400000000000002,3.72]
[null,null,null,null,null,null,null,null,null,null,null,null,null,null,null,"IV",null,"-","-",6,1330.42,34559.43,34592.86,48464.75,48464.75,411.7,"-",50010,50150,50170,"-","-",0.7,125,406.7,20030,20060,15050,15050,null,null,411.7,"-",50010,50150,50170,"-","-",0.7,125,406.7,20030,20060,15050,15050,0.7,125,3.21,74.94,43.48,29.56]
[null,null,null,null,null,null,null,null,null,null,null,null,null,null,null,"V",null,"-","-",9,1357.03,199867.7,208645.78,250568.98,250636.97,422.5,"-",195100,300800,304200,"-","-",0.7,126.1,409.1,112100,120400,91160,91190,null,null,422.5,"-",195100,300800,304200,"-","-",0.7,126.1,409.1,112100,120400,91160,91190,0.7,126.1,3.21,76.63,43.48,29.56]
[null,null,null,null,null,null,null,null,null,null,null,null,null,null,null,"CSAT",null,null,null,null,null,null,null,null,null,626.12,341.22,187.83,114.41,50.74,20.98,2.15,2373.06,1066.04,1391.47,841.71,388.02,137.16999999999999,11.05,null,null,626.12,341.22,187.83,114.41,50.74,20.98,2.15,2373.06,1066.04,1391.47,841.71,388.02,137.16999999999999,11.05,2373.06,1066.04,486,544.61,13645.95,597.25]
[]
[null,null,null,null,null,null,null,null,null,null,null,null,null,null,null,null,null,"en gras, les valeurs dépassent la CSAT (conc. À saturation)"]
[null,null,null,null,null,null,null,null,null,null,null,null,null,null,null,null,null,"le tiret \"-\" signifie que les concentrations dépassent le kg de polluant par kg de sol"]
[null,null,null,null,null,null,null,null,null,null,null,null,null,null,null,null,null,"valeurs surlignées en gris = VS (DS) car VSH<VS"]
[]
[]
[null,null,null,null,null,null,null,null,null,null,null,null,null,null,"VSE (GRER04)","usage",null,"conc. en mg/kg ms"]
[null,null,null,null,null,null,null,null,null,null,null,null,null,null,null,null,null,"Huile minérale \nEC5-35","Huile minérale \nEC10-40","Fraction\nEC 5-8","Fraction\nEC >8-10","Fraction\nEC >10-12","Fraction\nEC >12-16","Fraction\nEC >16-21","Fraction\nEC >21-35","ALI\nEC 5-6","ALI\nEC >6-8","ALI\nEC >8-10","ALI\nEC >10-12","ALI\nEC >12-16","ALI\nEC >16-21","ALI\nEC >21-35","Arom\nEC 6-7","Arom\nEC >7-8","Arom\nEC >8-10","Arom\nEC >10-12","Arom\nEC >12-16","Arom\nEC >16-21","Arom\nEC >21-35",null,null,"ALI\nEC 5-6","ALI\nEC >6-8","ALI\nEC >8-10","ALI\nEC >10-12","ALI\nEC >12-16","ALI\nEC >16-21","ALI\nEC >21-35","Arom\nEC 6-7","Arom\nEC >7-8","Arom\nEC >8-10","Arom\nEC >10-12","Arom\nEC >12-16","Arom\nEC >16-21","Arom\nEC >21-35","Benzène","Toluène","Ethylbenzène","Xylènes (somme)","MTBE","Naphtalène"]
[null,null,null,null,null,null,null,null,null,null,null,null,null,null,null,"I",null,"-","-",105,105,75,75,650,650,"-","-","-","-","-","-","-","-","-","-","-","-","-","-",null,null,{"$f":"Z75","v":"-"},{"$f":"AA75","v":"-"},{"$f":"AB75","v":"-"},{"$f":"AC75","v":"-"},{"$f":"AD75","v":"-"},{"$f":"AE75","v":"-"},{"$f":"AF75","v":"-"},{"$f":"AG75","v":"-"},{"$f":"AH75","v":"-"},{"$f":"AI75","v":"-"},{"$f":"AJ75","v":"-"},{"$f":"AK75","v":"-"},{"$f":"AL75","v":"-"},{"$f":"AM75","v":"-"},11,6,7.8,1.9,6.7,3.7]
[null,null,null,null,null,null,null,null,null,null,null,null,null,null,null,"II",null,"-","-",105,105,75,75,650,650,"-","-","-","-","-","-","-","-","-","-","-","-","-","-",null,null,"-","-","-","-","-","-","-","-","-","-","-","-","-","-",6.4,3.6,4.7,1.1000000000000001,4,3.7]
[null,null,null,null,null,null,null,null,null,null,null,null,null,null,null,"III",null,"-","-",105,105,75,75,650,650,"-","-","-","-","-","-","-","-","-","-","-","-","-","-",null,null,"-","-","-","-","-","-","-","-","-","-","-","-","-","-",14,8.5,12,2,8,7.2]
[]
[]
[]
[]
[]
[null,null,null,null,null,null,null,null,null,null,null,null,null,null,"BOF_SRA","MCS"]
[null,null,null,null,null,null,null,null,null,null,null,null,null,null,null,null,null,"Huile minérale \nEC5-35","Huile minérale \nEC10-40","Fraction\nEC 5-8","Fraction\nEC >8-10","Fraction\nEC >10-12","Fraction\nEC >12-16","Fraction\nEC >16-21","Fraction\nEC >21-35","ALI\nEC 5-6","ALI\nEC >6-8","ALI\nEC >8-10","ALI\nEC >10-12","ALI\nEC >12-16","ALI\nEC >16-21","ALI\nEC >21-35","Arom\nEC 6-7","Arom\nEC >7-8","Arom\nEC >8-10","Arom\nEC >10-12","Arom\nEC >12-16","Arom\nEC >16-21","Arom\nEC >21-35",null,null,"ALI\nEC 5-6","ALI\nEC >6-8","ALI\nEC >8-10","ALI\nEC >10-12","ALI\nEC >12-16","ALI\nEC >16-21","ALI\nEC >21-35","Arom\nEC 6-7","Arom\nEC >7-8","Arom\nEC >8-10","Arom\nEC >10-12","Arom\nEC >12-16","Arom\nEC >16-21","Arom\nEC >21-35","Benzène","Toluène","Ethylbenzène","Xylènes (somme)","MTBE","Naphtalène"]
[null,null,null,null,null,null,null,null,null,null,null,null,null,null,null,"LIMON MCS-1",null,4000,3900,"-",100,390,"-","-","-","-",4,36,336,1940,920,"-","-","-",64,56,460,280,"-",null,null,{"$f":"Z85","v":"-"},{"$f":"AA85","v":4},36,336,1940,920,"-","-","-",64,56,460,280,"-",0.16200000000000001,19,0.7,11.1,10,6]
[null,null,null,null,null,null,null,null,null,null,null,null,null,null,null,"LIMON MCS-2",null,7800,7600,"-",190,740,"-","-","-","-",7.625,68.625,640.5,3698.125,1753.75,"-","-","-",122,106.75,876.875,533.75,"-",null,null,{"$f":"Z86","v":"-"},{"$f":"AA86","v":7.625},{"$f":"AB86","v":68.625},{"$f":"AC86","v":640.5},{"$f":"AD86","v":3698.125},{"$f":"AE86","v":1753.75},{"$f":"AF86","v":"-"},{"$f":"AG86","v":"-"},{"$f":"AH86","v":"-"},{"$f":"AI86","v":122},{"$f":"AJ86","v":106.75},{"$f":"AK86","v":876.875},{"$f":"AL86","v":533.75},{"$f":"AM86","v":"-"},0.31,36.1,1.33,21.09,19,11.4]
[null,null,null,null,null,null,null,null,null,null,null,null,null,null,null,"LIMON MCS-3",null,2800,2800,"-",70,270,"-","-","-","-",2.8,25.3,236.3,1364,646.9,"-","-","-",45,39.4,323.39999999999998,196.9,"-",null,null,"-",2.8,25.3,236.3,1364,646.9,"-","-","-",45,39.4,323.39999999999998,196.9,"-",0.12,14,0.53500000000000003,8.35,7.5,4.5]
[null,null,null,null,null,null,null,null,null,null,null,null,null,null,null,"LIMON MCS-4",null,20000,19000,"-",490,1900,"-","-","-","-",19.899999999999999,179.3,1673,9662,4582,"-","-","-",318.8,278.89999999999998,2291,1395,"-",null,null,"-",19.899999999999999,179.3,1673,9662,4582,"-","-","-",318.8,278.89999999999998,2291,1395,"-",0.85,10,3.65,57,50,32]
[null,null,null,null,null,null,null,null,null,null,null,null,null,null,null,"LIMON MCS-5",null,20000,19000,"-",490,1900,"-","-","-","-",19.8,178.2,1663,9603,4554,"-","-","-",316.8,277.2,2277,1386,"-",null,null,"-",19.8,178.2,1663,9603,4554,"-","-","-",316.8,277.2,2277,1386,"-",0.81,94.5,3.7,55.5,47,29.5]
[null,null,null,null,null,null,null,null,null,null,null,null,null,null,null,"LIMON MCS-6",null,20000,20000,"-",1000,20000,"-","-","-","-",360,3240,30240,174600,82800,"-","-","-",5760,5040,41400,25200,"-",null,null,"-",360,3240,30240,174600,82800,"-","-","-",5760,5040,41400,25200,"-",14,3000,63,4000,800,540]
[null,null,null,null,null,null,null,null,null,null,null,null,null,null,null,"LIMON MCS-7",null,20000,20000,"-",1000,20000,"-","-","-","-",360,3240,30240,174600,82800,"-","-","-",5760,5040,41400,25200,"-",null,null,"-",360,3240,30240,174600,82800,"-","-","-",5760,5040,41400,25200,"-",7,840,32,475,440,260]
[null,null,null,null,null,null,null,null,null,null,null,null,null,null,null,"LIMON SABLEUX MCS-1",null,3200,3100,"-",80,310,"-","-","-","-",3.2,28.7,267.8,1546,733.1,"-","-","-",51,44.6,366.6,223.1,"-",null,null,"-",3.2,28.7,267.8,1546,733.1,"-","-","-",51,44.6,366.6,223.1,"-",0.12,13.5,0.5,7.68,7.7,4.5]
[null,null,null,null,null,null,null,null,null,null,null,null,null,null,null,"LIMON SABLEUX MCS-2",null,5400,5300,"-",130,520,"-","-","-","-",5.3,48.1,448.9,2592,1229,"-","-","-",85.5,74.8,614.5,374.1,"-",null,null,"-",5.3,48.1,448.9,2592,1229,"-","-","-",85.5,74.8,614.5,374.1,"-",0.31,36.1,1.33,21.09,19,11.4]
[null,null,null,null,null,null,null,null,null,null,null,null,null,null,null,"LIMON SABLEUX MCS-3",null,1500,1400,"-",37,140,"-","-","-","-",1.456,13.16,122.9,709.3,336.4,"-","-","-",23.4,20.49,168.2,102.4,"-",null,null,"-",1.456,13.16,122.9,709.3,336.4,"-","-","-",23.4,20.49,168.2,102.4,"-",9.9000000000000005E-2,1.1000000000000001,0.44500000000000001,6.68,6.2,3.8]
[null,null,null,null,null,null,null,null,null,null,null,null,null,null,null,"LIMON SABLEUX MCS-4",null,14000,13000,"-",340,1300,"-","-","-","-",13.78,125.1,1167,6739,3195,"-","-","-",222.3,194.5,1598,972.7,"-",null,null,"-",13.78,125.1,1167,6739,3195,"-","-","-",222.3,194.5,1598,972.7,"-",0.58499999999999996,69,2.65,40.200000000000003,36.25,22.5]
[null,null,null,null,null,null,null,null,null,null,null,null,null,null,null,"LIMON SABLEUX MCS-5",null,15000,14000,"-",370,1400,"-","-","-","-",14.85,133.69999999999999,1247,7202,3415,"-","-","-",237.6,207.9,1708,1040,"-",null,null,"-",14.85,133.69999999999999,1247,7202,3415,"-","-","-",237.6,207.9,1708,1040,"-",0.61,72.5,2.76,42,36,22.75]
[null,null,null,null,null,null,null,null,null,null,null,null,null,null,null,"LIMON SABLEUX MCS-6",null,20000,20000,"-",1000,20000,"-","-","-","-",360,3240,30240,174600,82800,"-","-","-",5760,5040,41400,25200,"-",null,null,"-",360,3240,30240,174600,82800,"-","-","-",5760,5040,41400,25200,"-",8.9,1200,40,3800,550,340]
[null,null,null,null,null,null,null,null,null,null,null,null,null,null,null,"LIMON SABLEUX MCS-7",null,20000,20000,"-",1000,20000,"-","-","-","-",360,3240,30240,174600,82800,"-","-","-",5760,5040,41400,25200,"-",null,null,"-",360,3240,30240,174600,82800,"-","-","-",5760,5040,41400,25200,"-",4.6500000000000004,550,20,290,290,160]
[null,null,null,null,null,null,null,null,null,null,null,null,null,null,null,"ARGILE MCS-1",null,9000,8700,"-",220,860,"-","-","-","-",8.8000000000000007,79.2,739.2,4268,2024,"-","-","-",140.80000000000001,123.2,1012,616,"-",null,null,"-",8.8000000000000007,79.2,739.2,4268,2024,"-","-","-",140.80000000000001,123.2,1012,616,"-",0.33,37.5,1.5,22,16,12]
[null,null,null,null,null,null,null,null,null,null,null,null,null,null,null,"ARGILE MCS-2",null,17000,16000,"-",420,1600,"-","-","-","-",16.8,151.30000000000001,1412,8154,3867,"-","-","-",269,235.4,1933,1177,"-",null,null,"-",16.8,151.30000000000001,1412,8154,3867,"-","-","-",269,235.4,1933,1177,"-",0.66,75,3,44,32,24]
[null,null,null,null,null,null,null,null,null,null,null,null,null,null,null,"ARGILE MCS-3",null,20000,5900,"-",140,580,"-","-","-","-",5.94,53.46,499,2881,1366,"-","-","-",95.04,83.16,683.1,415.8,"-",null,null,"-",5.94,53.46,499,2881,1366,"-","-","-",95.04,83.16,683.1,415.8,"-",0.22950000000000001,28,1.075,16.25,11.5,8.8000000000000007]
[null,null,null,null,null,null,null,null,null,null,null,null,null,null,null,"ARGILE MCS-4",null,20000,20000,"-",1000,4600,"-","-","-","-",47.08,423.7,3955,22830,10830,"-","-","-",753.3,659.1,5414,3296,"-",null,null,"-",47.08,423.7,3955,22830,10830,"-","-","-",753.3,659.1,5414,3296,"-",1.87,227,8.9049999999999994,132.5,95,75]
[null,null,null,null,null,null,null,null,null,null,null,null,null,null,null,"ARGILE MCS-5",null,20000,20000,"-",1000,4200,"-","-","-","-",43.56,392,3659,21130,10020,"-","-","-",697,609.79999999999995,5009,3049,"-",null,null,"-",43.56,392,3659,21130,10020,"-","-","-",697,609.79999999999995,5009,3049,"-",0.33,37.5,1.5,22,16,12]
[null,null,null,null,null,null,null,null,null,null,null,null,null,null,null,"ARGILE MCS-6",null,20000,20000,"-",1000,20000,"-","-","-","-",360,3240,30240,174600,82800,"-","-","-",5760,5040,41400,25200,"-",null,null,"-",360,3240,30240,174600,82800,"-","-","-",5760,5040,41400,25200,"-",31.5,6000,127.5,8000,1650,1050]
[null,null,null,null,null,null,null,null,null,null,null,null,null,null,null,"ARGILE MCS-7",null,20000,20000,"-",1000,20000,"-","-","-","-",360,3240,30240,174600,82800,"-","-","-",5760,5040,41400,25200,"-",null,null,"-",360,3240,30240,174600,82800,"-","-","-",5760,5040,41400,25200,"-",15.1,1725,60.3,875,819,490]
[null,null,null,null,null,null,null,null,null,null,null,null,null,null,null,"LIMON CAILLOUTEUX MCS-1",null,7800,7600,"-",190,740,"-","-","-","-",7.6,68.599999999999994,640.5,3698,1754,"-","-","-",122,106.8,876.9,533.79999999999995,"-",null,null,"-",7.6,68.599999999999994,640.5,3698,1754,"-","-","-",122,106.8,876.9,533.79999999999995,"-",0.28999999999999998,33.5,1.35,20,14,12]
[null,null,null,null,null,null,null,null,null,null,null,null,null,null,null,"LIMON CAILLOUTEUX MCS-2",null,14000,14000,"-",360,1400,"-","-","-","-",14.4,129.9,1213,7002,3321,"-","-","-",231,202.1,1660,1011,"-",null,null,"-",14.4,129.9,1213,7002,3321,"-","-","-",231,202.1,1660,1011,"-",0.48499999999999999,59.5,2.5,35,25,22.5]
[null,null,null,null,null,null,null,null,null,null,null,null,null,null,null,"LIMON CAILLOUTEUX MCS-3",null,3400,3300,"-",84,320,"-","-","-","-",3.3439999999999999,30.18,281.8,1627,771.8,"-","-","-",53.68,46.99,385.8,234.9,"-",null,null,"-",3.3439999999999999,30.18,281.8,1627,771.8,"-","-","-",53.68,46.99,385.8,234.9,"-",0.216,26.2,1.02,15,10.53,9]
[null,null,null,null,null,null,null,null,null,null,null,null,null,null,null,"LIMON CAILLOUTEUX MCS-4",null,2000,20000,"-",1000,4600,"-","-","-","-",36.49,328.4,3065,17690,8393,"-","-","-",583.79999999999995,510.8,4196,2554,"-",null,null,"-",36.49,328.4,3065,17690,8393,"-","-","-",583.79999999999995,510.8,4196,2554,"-",1.42,172.5,6.6619999999999999,102,68.5,59.5]
[null,null,null,null,null,null,null,null,null,null,null,null,null,null,null,"LIMON CAILLOUTEUX MCS-5",null,20000,20000,"-",1000,4200,"-","-","-","-",31.4,282.2,2635,15210,7214,"-","-","-",501.8,439.1,3607,2195,"-",null,null,"-",31.4,282.2,2635,15210,7214,"-","-","-",501.8,439.1,3607,2195,"-",1.2,147,5.75,87,57,49]
[null,null,null,null,null,null,null,null,null,null,null,null,null,null,null,"LIMON CAILLOUTEUX MCS-6",null,20000,20000,"-",1000,20000,"-","-","-","-",360,3240,30240,174600,82800,"-","-","-",5760,5040,41400,25200,"-",null,null,"-",360,3240,30240,174600,82800,"-","-","-",5760,5040,41400,25200,"-",23,6000,110,8000,1125,990]
[null,null,null,null,null,null,null,null,null,null,null,null,null,null,null,"LIMON CAILLOUTEUX MCS-7",null,20000,20000,"-",1000,20000,"-","-","-","-",360,3240,30240,174600,82800,"-","-","-",5760,5040,41400,25200,"-",null,null,"-",360,3240,30240,174600,82800,"-","-","-",5760,5040,41400,25200,"-",11.5,1400,55.75,800,570,493]
[null,null,null,null,null,null,null,null,null,null,null,null,null,null,null,"SABLE MCS-1",null,930,910,"-",23,90,"-","-","-","-",0.92,8.25,77,444.6,210.8,"-","-","-",14.67,12.83,105.4,64.17,"-",null,null,"-",0.92,8.25,77,444.6,210.8,"-","-","-",14.67,12.83,105.4,64.17,"-",0.05,6,0.22,3.5,2.1,2]
[null,null,null,null,null,null,null,null,null,null,null,null,null,null,null,"SABLE MCS-2",null,1600,1600,"-",41,160,"-","-","-","-",1.643,14.79,138,796.8,377.9,"-","-","-",26.29,23,188.9,115,"-",null,null,"-",1.643,14.79,138,796.8,377.9,"-","-","-",26.29,23,188.9,115,"-",0.1,12.5,0.45,6.9,4.5,4.4000000000000004]
[null,null,null,null,null,null,null,null,null,null,null,null,null,null,null,"SABLE MCS-3",null,790,770,"-",21,76,"-","-","-","-",0.77300000000000002,6.9459999999999997,65,375.3,178,"-","-","-",12.38,10.83,88.99,54.16,"-",null,null,"-",0.77300000000000002,6.9459999999999997,65,375.3,178,"-","-","-",12.38,10.83,88.99,54.16,"-",4.65E-2,5.55,0.21,3.15,2.0499999999999998,1.9]
[null,null,null,null,null,null,null,null,null,null,null,null,null,null,null,"SABLE MCS-4",null,6300,6200,"-",150,610,"-","-","-","-",6.2,56.1,523.70000000000005,3024,1434,"-","-","-",99.8,87.3,717,436.4,"-",null,null,"-",6.2,56.1,523.70000000000005,3024,1434,"-","-","-",99.8,87.3,717,436.4,"-",0.22500000000000001,28,1.1000000000000001,16.5,9.5,10]
[null,null,null,null,null,null,null,null,null,null,null,null,null,null,null,"SABLE MCS-5",null,9900,9700,"-",240,950,"-","-","-","-",9.75,87.75,819,4729,2243,"-","-","-",156,136.5,1121,682.5,"-",null,null,"-",9.75,87.75,819,4729,2243,"-","-","-",156,136.5,1121,682.5,"-",0.35499999999999998,44.5,1.55,25.5,14.5,14.5]
[null,null,null,null,null,null,null,null,null,null,null,null,null,null,null,"SABLE MCS-6",null,20000,20000,"-",900,3500,"-","-","-","-",36,324,3024,17460,8280,"-","-","-",576,504,4140,2520,"-",null,null,"-",36,324,3024,17460,8280,"-","-","-",576,504,4140,2520,"-",1.5,170,6,90,65,48]
[null,null,null,null,null,null,null,null,null,null,null,null,null,null,null,"SABLE MCS-7",null,22000,20000,"-",540,2200,"-","-","-","-",21.6,194.4,1914,10480,4968,"-","-","-",345.6,302.39999999999998,2484,1512,"-",null,null,"-",21.6,194.4,1914,10480,4968,"-","-","-",345.6,302.39999999999998,2484,1512,"-",0.71,83,2.8,43,31.5,23.8]
[]
[]
[]
[null,null,null,null,null,null,null,null,null,null,null,null,null,null,"VSN (GRER v04 parti C)","usage",null,"conc. en mg/kg ms"]
[null,null,null,null,null,null,null,null,null,null,null,null,null,null,null,null,null,"Huile minérale \nEC5-35","Huile minérale \nEC10-40","Fraction\nEC 5-8","Fraction\nEC >8-10","Fraction\nEC >10-12","Fraction\nEC >12-16","Fraction\nEC >16-21","Fraction\nEC >21-35","ALI\nEC 5-6","ALI\nEC >6-8","ALI\nEC >8-10","ALI\nEC >10-12","ALI\nEC >12-16","ALI\nEC >16-21","ALI\nEC >21-35","Arom\nEC 6-7","Arom\nEC >7-8","Arom\nEC >8-10","Arom\nEC >10-12","Arom\nEC >12-16","Arom\nEC >16-21","Arom\nEC >21-35",null,null,"ALI\nEC 5-6","ALI\nEC >6-8","ALI\nEC >8-10","ALI\nEC >10-12","ALI\nEC >12-16","ALI\nEC >16-21","ALI\nEC >21-35","Arom\nEC 6-7","Arom\nEC >7-8","Arom\nEC >8-10","Arom\nEC >10-12","Arom\nEC >12-16","Arom\nEC >16-21","Arom\nEC >21-35","Benzène","Toluène","Ethylbenzène","Xylènes (somme)","MTBE","Naphtalène"]
[null,null,null,null,null,null,null,null,null,null,null,null,null,null,null,"I",null,"-","-",6.2,211,884,8459,481309,1000000,"-","-","-","-","-","-","-","-","-","-","-","-","-","-",null,null,{"$f":"Z125","v":"-"},"-","-","-","-","-","-","-","-","-","-","-","-","-",0.2,9.1999999999999993,8,11,1.6,3.8]
[null,null,null,null,null,null,null,null,null,null,null,null,null,null,null,"II",null,"-","-",5.8,169,679,6415,361909,1000000,"-","-","-","-","-","-","-","-","-","-","-","-","-","-",null,null,"-","-","-","-","-","-","-","-","-","-","-","-","-","-",0.2,7.8,6.4,8.9,1.5,2.9]
[null,null,null,null,null,null,null,null,null,null,null,null,null,null,null,"III",null,"-","-",6,149,577,5393,302208,1000000,"-","-","-","-","-","-","-","-","-","-","-","-","-","-",null,null,"-","-","-","-","-","-","-","-","-","-","-","-","-","-",0.2,7.1,6,7.9,1.5,2.5]
[null,null,null,null,null,null,null,null,null,null,null,null,null,null,null,"IV",null,"-","-",6,149,577,5393,302208,1000000,"-","-","-","-","-","-","-","-","-","-","-","-","-","-",null,null,"-","-","-","-","-","-","-","-","-","-","-","-","-","-",0.2,7.1,6,7.9,1.5,2.5]
[null,null,null,null,null,null,null,null,null,null,null,null,null,null,null,"V",null,"-","-",10,601,2792,27541,1000000,1000000,"-","-","-","-","-","-","-","-","-","-","-","-","-","-",null,null,"-","-","-","-","-","-","-","-","-","-","-","-","-","-",0.21,22,23,30,2,12]
[]
[]
[]
[null,null,null,null,null,null,null,null,null,null,null,null,null,null,"VLN (GRER v04 parti C)","usage",null,"conc. en mg/kg ms"]
[null,null,null,null,null,null,null,null,null,null,null,null,null,null,null,null,null,"Huile minérale \nEC5-35","Huile minérale \nEC10-40","Fraction\nEC 5-8","Fraction\nEC >8-10","Fraction\nEC >10-12","Fraction\nEC >12-16","Fraction\nEC >16-21","Fraction\nEC >21-35","ALI\nEC 5-6","ALI\nEC >6-8","ALI\nEC >8-10","ALI\nEC >10-12","ALI\nEC >12-16","ALI\nEC >16-21","ALI\nEC >21-35","Arom\nEC 6-7","Arom\nEC >7-8","Arom\nEC >8-10","Arom\nEC >10-12","Arom\nEC >12-16","Arom\nEC >16-21","Arom\nEC >21-35",null,null,"ALI\nEC 5-6","ALI\nEC >6-8","ALI\nEC >8-10","ALI\nEC >10-12","ALI\nEC >12-16","ALI\nEC >16-21","ALI\nEC >21-35","Arom\nEC 6-7","Arom\nEC >7-8","Arom\nEC >8-10","Arom\nEC >10-12","Arom\nEC >12-16","Arom\nEC >16-21","Arom\nEC >21-35","Benzène","Toluène","Ethylbenzène","Xylènes (somme)","MTBE","Naphtalène"]
[null,null,null,null,null,null,null,null,null,null,null,null,null,null,null,"I",null,"-","-",12.4,422,1768,16918,962618,1000000,"-","-","-","-","-","-","-","-","-","-","-","-","-","-",null,null,{"$f":"Z135","v":"-"},"-","-","-","-","-","-","-","-","-","-","-","-","-",1,77,41,48,6.59,26]
[null,null,null,null,null,null,null,null,null,null,null,null,null,null,null,"II",null,"-","-",11.6,338,1358,12830,723818,1000000,"-","-","-","-","-","-","-","-","-","-","-","-","-","-",null,null,"-","-","-","-","-","-","-","-","-","-","-","-","-","-",1,65,32,39,6.18,20]
[null,null,null,null,null,null,null,null,null,null,null,null,null,null,null,"III",null,"-","-",12,298,1154,10786,604416,1000000,"-","-","-","-","-","-","-","-","-","-","-","-","-","-",null,null,"-","-","-","-","-","-","-","-","-","-","-","-","-","-",1,59,30,34,6.18,17]
[null,null,null,null,null,null,null,null,null,null,null,null,null,null,null,"IV",null,"-","-",12,298,1154,10786,604416,1000000,"-","-","-","-","-","-","-","-","-","-","-","-","-","-",null,null,"-","-","-","-","-","-","-","-","-","-","-","-","-","-",1,59,30,34,6.18,17]
[null,null,null,null,null,null,null,null,null,null,null,null,null,null,null,"V",null,"-","-",20,1202,5584,55082,1000000,1000000,"-","-","-","-","-","-","-","-","-","-","-","-","-","-",null,null,"-","-","-","-","-","-","-","-","-","-","-","-","-","-",1,184,117,131,8.23,82]
[]
[]
[]
[]
[]
[]
[]
[]
[]
[]
[]
[]
[]
[null,null,null,null,null,null,null,null,null,null,null,null,null,null,null,null,null,null,null,null,null,null,null,null,null,null,null,null,null,null,null,null,null,null,null,null,null,null,null,null,null,null,null,null,null,null,null,null,null,null,null,null,null,"berekeningsfactor individuele fractie uit MO totaal"]
[null,null,null,null,null,null,null,null,null,null,null,null,null,null,null,null,null,null,null,null,null,null,null,null,null,null,null,null,null,null,null,null,null,null,null,null,null,null,null,null,null,null,null,null,null,null,null,null,null,null,null,null,null,"ec5-35","ec10-40"]
[]
[null,null,null,null,null,null,null,null,null,null,null,null,null,null,null,null,null,null,null,null,null,null,null,null,null,null,null,null,null,null,null,null,null,null,null,null,null,null,null,null,null,"TPH aliphatic (EC 5-6)",null,null,null,null,null,null,null,null,null,null,null,0,0]
[null,null,null,null,null,null,null,null,null,null,null,null,null,null,null,null,null,null,null,null,null,null,null,null,null,null,null,null,null,null,null,null,null,null,null,null,null,null,null,null,null,"TPH aliphatic (EC >6-8)",null,null,null,null,null,null,null,null,null,null,null,9.765625E-2,0.10020040028754905]
[null,null,null,null,null,null,null,null,null,null,null,null,null,null,null,null,null,null,null,null,null,null,null,null,null,null,null,null,null,null,null,null,null,null,null,null,null,null,null,null,null,"TPH aliphatic (EC >8-10)",null,null,null,null,null,null,null,null,null,null,null,0.87890625,0.90180360258794146]
[null,null,null,null,null,null,null,null,null,null,null,null,null,null,null,null,null,null,null,null,null,null,null,null,null,null,null,null,null,null,null,null,null,null,null,null,null,null,null,null,null,"TPH aliphatic (EC >10-12)",null,null,null,null,null,null,null,null,null,null,null,8.203125,8.4168336241541208]
[null,null,null,null,null,null,null,null,null,null,null,null,null,null,null,null,null,null,null,null,null,null,null,null,null,null,null,null,null,null,null,null,null,null,null,null,null,null,null,null,null,"TPH aliphatic (EC >12-16)",null,null,null,null,null,null,null,null,null,null,null,47.36328125,48.597194139461287]
[null,null,null,null,null,null,null,null,null,null,null,null,null,null,null,null,null,null,null,null,null,null,null,null,null,null,null,null,null,null,null,null,null,null,null,null,null,null,null,null,null,"TPH aliphatic (EC >16-21)",null,null,null,null,null,null,null,null,null,null,null,22.4609375,23.046092066136282]
[null,null,null,null,null,null,null,null,null,null,null,null,null,null,null,null,null,null,null,null,null,null,null,null,null,null,null,null,null,null,null,null,null,null,null,null,null,null,null,null,null,"TPH aliphatic (EC >21-35)",null,null,null,null,null,null,null,null,null,null,null,0,0]
[null,null,null,null,null,null,null,null,null,null,null,null,null,null,null,null,null,null,null,null,null,null,null,null,null,null,null,null,null,null,null,null,null,null,null,null,null,null,null,null,null,"TPH aromatic (EC >6-7)",null,null,null,null,null,null,null,null,null,null,null,0,0]
[null,null,null,null,null,null,null,null,null,null,null,null,null,null,null,null,null,null,null,null,null,null,null,null,null,null,null,null,null,null,null,null,null,null,null,null,null,null,null,null,null,"TPH aromatic (EC >7-8)",null,null,null,null,null,null,null,null,null,null,null,0,0]
[null,null,null,null,null,null,null,null,null,null,null,null,null,null,null,null,null,null,null,null,null,null,null,null,null,null,null,null,null,null,null,null,null,null,null,null,null,null,null,null,null,"TPH aromatic (EC >8-10)",null,null,null,null,null,null,null,null,null,null,null,1.5625,1.6032064046007848]
[null,null,null,null,null,null,null,null,null,null,null,null,null,null,null,null,null,null,null,null,null,null,null,null,null,null,null,null,null,null,null,null,null,null,null,null,null,null,null,null,null,"TPH aromatic (EC >10-12)",null,null,null,null,null,null,null,null,null,null,null,1.3671875,1.4028056040256867]
[null,null,null,null,null,null,null,null,null,null,null,null,null,null,null,null,null,null,null,null,null,null,null,null,null,null,null,null,null,null,null,null,null,null,null,null,null,null,null,null,null,"TPH aromatic (EC >12-16)",null,null,null,null,null,null,null,null,null,null,null,11.23046875,11.523046033068141]
[null,null,null,null,null,null,null,null,null,null,null,null,null,null,null,null,null,null,null,null,null,null,null,null,null,null,null,null,null,null,null,null,null,null,null,null,null,null,null,null,null,"TPH aromatic (EC >16-21)",null,null,null,null,null,null,null,null,null,null,null,6.8359375,7.0140280201284337]
[null,null,null,null,null,null,null,null,null,null,null,null,null,null,null,null,null,null,null,null,null,null,null,null,null,null,null,null,null,null,null,null,null,null,null,null,null,null,null,null,null,"TPH aromatic (EC >21-35)",null,null,null,null,null,null,null,null,null,null,null,0,0]

{"sheet":"AR Sol BOF_TRA & SRA","index":4,"n_rows":139,"n_cols":108,"rows_kept":139,"cut":false,"hidden":false,"merged":[[7,1,7,16],[18,1,18,16],[21,1,21,16],[2,2,2,60],[1,1,1,24],[3,6,3,8],[3,10,3,14],[3,2,3,5],[32,1,32,6],[29,7,29,9],[4,1,5,9],[4,10,5,14],[5,17,5,18],[32,10,32,14],[31,10,31,14],[29,10,29,14],[27,10,27,14],[26,10,26,14],[30,10,30,14],[28,1,28,6],[29,1,29,6],[30,1,30,6],[26,1,26,6],[32,7,32,9],[31,7,31,9],[30,7,30,9],[31,1,31,6],[27,1,27,6],[25,10,25,14],[28,10,28,14],[28,7,28,9],[27,7,27,9],[26,7,26,9],[5,64,5,65],[5,41,5,54],[5,62,5,63],[25,1,25,6],[4,15,5,15],[4,62,4,63],[4,64,4,107],[4,16,5,16],[5,72,5,85],[5,87,5,100],[5,55,5,60],[5,66,5,71],[25,7,25,9],[5,19,5,24],[5,25,5,38],[4,17,4,60]]}
[]
[null,"Perceptions de chantier et comparaison des résultats d'analyse (DS) pour la partie fixe du sol "]
[null,"Projet:",{"$f":"'Manuel d''utilisation'!C3","v":"BOF_SL_6000: Rue de la Station, 666 à 4308 Manage"}]
[null,"Type usage DS",{"$f":"K26","v":"I"},null,null,null,"MO(%):",null,null,{"$f":"'Manuel d''utilisation'!C10","v":3},null,null,null,null,null,"<2µm (%):",{"$f":"'Manuel d''utilisation'!C11","v":7},{"$f":"'Manuel d''utilisation'!AU11","v":0}]
[null,"Identification du forage",null,null,null,null,null,null,null,null,"Caractéristiques organoleptiques",null,null,null,null,"Echantillon","MS","Résultats d'analyse en mg/kg ms",null,null,null,null,null,null,null,null,null,null,null,null,null,null,null,null,null,null,null,null,null,null,null,null,null,null,null,null,null,null,null,null,null,null,null,null,null,null,null,null,null,null,null,null,"Impact gravier",null,"Résultats d'analyse en mg/kg ms après réévaluation sur base du facteur correctif (gravier)"]
[null,null,null,null,null,null,null,null,null,null,null,null,null,null,null,null,null,"HM somme",null,"Hydrocarbures pétroliers\n(fractions globales/combinées)",null,null,null,null,null,"Hydrocarbures pétroliers\n(analyse 'split' aliphatique/aromatique)",null,null,null,null,null,null,null,null,null,null,null,null,null,null,null,"Hydrocarbures pétroliers\ncalculés sur base de la répartition standard diesel",null,null,null,null,null,null,null,null,null,null,null,null,null,"Hydrocarbures aromatiques non halogénés",null,null,null,null,null,null,"Facteur correctif",null,"HM\nsomme",null,"Hydrocarbures pétroliers\n(fractions globales/combinées)",null,null,null,null,null,"Hydrocarbures pétroliers\n(analyse 'split' aliphatique/aromatique)",null,null,null,null,null,null,null,null,null,null,null,null,null,null,"Hydrocarbures pétroliers\ncalculés sur base de la répartition standard diesel",null,null,null,null,null,null,null,null,null,null,null,null,null,null,null,"Hydrocarbures aromatiques non halogénés"]
[null,"Parcelle cadastrale","Code du forage","X (Lambert)","Y (Lambert)","Refus de forage(6)","Date du forage","Phase d'étude(6)","Terrain naturel (TN) / Remblai (R)(6)","Profondeur du forage \n(cm-ns)","Profondeur: de (cm-ns) \nà (cm-ns)","Caractérisation(1) (6)","Odeur/PID(2)","Couleur suspecte(6)","Test huile/eau(2)","Profondeur \nde l'échantillon (cm-ns)","Matière sèche (%)","Huile minérale \nEC 5-35","Huile minérale \nEC 10-40","Fraction\nEC 5-8","Fraction\nEC 8-10","Fraction\nEC 10-12","Fraction\nEC 12-16","Fraction\nEC 16-21","Fraction\nEC 21-35","Ali\nEC 5-6","Ali\nEC 6-8","Ali\nEC 8-10","Ali\nEC 10-12","Ali\nEC 12-16","Ali\nEC 16-21","Ali\nEC 21-35","Aro\nEC 6-7","Aro\nEC 7-8","Aro\nEC 8-10","Aro\nEC 10-12","Aro\nEC 12-16","Aro\nEC 16-21","Aro\nEC 21-35",null,"Nature TPH(7) (6)","Ali\nEC 5-6","Ali\nEC 6-8","Ali\nEC 8-10","Ali\nEC 10-12","Ali\nEC 12-16","Ali\nEC 16-21","Ali\nEC 21-35","Aro\nEC 6-7","Aro\nEC 7-8","Aro\nEC 8-10","Aro\nEC 10-12","Aro\nEC 12-16","Aro\nEC 16-21","Aro\nEC 21-35","Benzène","Toluène","Ethylbenzène","Xylènes (somme)","MTBE","Naphtalène",null,"pourcentage de cailloux","pourcentage de matières fines","Huile minérale \nEC 5-35","Huile minérale \nEC 10-40","Fraction\nEC 5-8","Fraction\nEC 8-10","Fraction\nEC 10-12","Fraction\nEC 12-16","Fraction\nEC 16-21","Fraction\nEC 21-35","Ali\nEC 5-6","Ali\nEC 6-8","Ali\nEC 8-10","Ali\nEC 10-12","Ali\nEC 12-16","Ali\nEC 16-21","Ali\nEC 21-35","Aro\nEC 6-7","Aro\nEC 7-8","Aro\nEC 8-10","Aro\nEC 10-12","Aro\nEC 12-16","Aro\nEC 16-21","Aro\nEC 21-35",null,"Ali\nEC 5-6","Ali\nEC 6-8","Ali\nEC 8-10","Ali\nEC 10-12","Ali\nEC 12-16","Ali\nEC 16-21","Ali\nEC 21-35","Aro\nEC 6-7","Aro\nEC 7-8","Aro\nEC 8-10","Aro\nEC 10-12","Aro\nEC 12-16","Aro\nEC 16-21","Aro\nEC 21-35",null,"Benzène","Toluène","Ethylbenzène","Xylènes (somme)","MTBE","Naphtalène"]
[null,"Zone suspecte investiguée:"]
[null,"1076Z","C1",null,null,null,"28/12/2004","EO","R",420,"150-200","DI","*",null,null,"370-400",null,null,100,"<12",22,120,800,10000,7,"<12.5",100,1000,null,null,null,null,null,null,null,null,null,null,null,null,"DI",null,{"$f":"IF(($AO9<>\"DI\"),\"np\",IF($R9<>\"\",IFERROR(0.00098*($R9),\"<\"),IF($S9<>\"\",IFERROR(0.001002*($S9),\"<\"),\"\")))","v":0.10020000000000001},{"$f":"IF(($AO9<>\"DI\"),\"np\",IF($R9<>\"\",IFERROR(0.00879*($R9),\"<\"),IF($S9<>\"\",IFERROR(0.00901804*($S9),\"<\"),\"\")))","v":0.90180399999999994},{"$f":"IF(($AO9<>\"DI\"),\"np\",IF($R9<>\"\",IFERROR(0.08203*($R9),\"<\"),IF($S9<>\"\",IFERROR(0.08416834*($S9),\"<\"),\"\")))","v":8.4168339999999997},{"$f":"IF(($AO9<>\"DI\"),\"np\",IF($R9<>\"\",IFERROR(0.47363*($R9),\"<\"),IF($S9<>\"\",IFERROR(0.4859719*($S9),\"<\"),\"\")))","v":48.597189999999998},{"$f":"IF(($AO9<>\"DI\"),\"np\",IF($R9<>\"\",IFERROR(0.22461*($R9),\"<\"),IF($S9<>\"\",IFERROR(0.2304609*($S9),\"<\"),\"\")))","v":23.04609},null,null,null,{"$f":"IF(($AO9<>\"DI\"),\"np\",IF($R9<>\"\",IFERROR(0.01563*($R9),\"<\"),IF($S9<>\"\",IFERROR(0.01603206*($S9),\"<\"),\"\")))","v":1.6032060000000001},{"$f":"IF(($AO9<>\"DI\"),\"np\",IF($R9<>\"\",IFERROR(0.01367*($R9),\"<\"),IF($S9<>\"\",IFERROR(0.01402806*($S9),\"<\"),\"\")))","v":1.402806},{"$f":"IF(($AO9<>\"DI\"),\"np\",IF($R9<>\"\",IFERROR(0.1123*($R9),\"<\"),IF($S9<>\"\",IFERROR(0.1152305*($S9),\"<\"),\"\")))","v":11.52305},{"$f":"IF(($AO9<>\"DI\"),\"np\",IF($R9<>\"\",IFERROR(0.06836*($R9),\"<\"),IF($S9<>\"\",IFERROR(0.07014028*($S9),\"<\"),\"\")))","v":7.0140279999999997},null,"<",7,1,0.01,0.01,2.5499999999999998,null,null,0.2,{"$f":"IFERROR($BL9*R9,\"<\")","v":0},20,"<",4.4000000000000004,24,160,2000,1.4000000000000001,"<",20,200,0,0,0,0,0,{"$f":"IFERROR($BL9*AH9,\"<\")","v":0},0,0,0,0,0,null,{"$f":"IFERROR($BL9*AP9,\"<\")","v":0},{"$f":"IF(($AO9=\"DI\"),IFERROR($BL9*AQ9,\"<\"),\"np\")","v":2.0040000000000002E-2},0.18036079999999999,1.6833667999999999,9.7194380000000002,4.6092180000000003,{"$f":"$BL9*AV9","v":0},0,0,{"$f":"IF(($AO9=\"DI\"),IFERROR($BL9*AY9,\"<\"),\"np\")","v":0.32064120000000007},0.28056120000000001,2.3046099999999998,1.4028056,{"$f":"$BL9*BC9","v":0},null,{"$f":"IFERROR($BL9*BD9,\"<\")","v":"<"},1.4000000000000001,0.2,2E-3,2E-3,0.51]
[null,null,null,null,null,null,null,null,null,null,null,null,null,null,null,null,null,100,null,null,null,null,null,null,null,null,null,null,null,null,null,null,null,null,null,null,null,null,null,null,"DI",null,{"$f":"IF(($AO10<>\"DI\"),\"np\",IF($R10<>\"\",IFERROR(0.00098*($R10),\"<\"),IF($S10<>\"\",IFERROR(0.001002*($S10),\"<\"),\"\")))","v":9.8000000000000004E-2},{"$f":"IF(($AO10<>\"DI\"),\"np\",IF($R10<>\"\",IFERROR(0.00879*($R10),\"<\"),IF($S10<>\"\",IFERROR(0.00901804*($S10),\"<\"),\"\")))","v":0.87899999999999989},{"$f":"IF(($AO10<>\"DI\"),\"np\",IF($R10<>\"\",IFERROR(0.08203*($R10),\"<\"),IF($S10<>\"\",IFERROR(0.08416834*($S10),\"<\"),\"\")))","v":8.2030000000000012},{"$f":"IF(($AO10<>\"DI\"),\"np\",IF($R10<>\"\",IFERROR(0.47363*($R10),\"<\"),IF($S10<>\"\",IFERROR(0.4859719*($S10),\"<\"),\"\")))","v":47.363},{"$f":"IF(($AO10<>\"DI\"),\"np\",IF($R10<>\"\",IFERROR(0.22461*($R10),\"<\"),IF($S10<>\"\",IFERROR(0.2304609*($S10),\"<\"),\"\")))","v":22.461000000000002},null,null,null,{"$f":"IF(($AO10<>\"DI\"),\"np\",IF($R10<>\"\",IFERROR(0.01563*($R10),\"<\"),IF($S10<>\"\",IFERROR(0.01603206*($S10),\"<\"),\"\")))","v":1.5630000000000002},{"$f":"IF(($AO10<>\"DI\"),\"np\",IF($R10<>\"\",IFERROR(0.01367*($R10),\"<\"),IF($S10<>\"\",IFERROR(0.01402806*($S10),\"<\"),\"\")))","v":1.367},{"$f":"IF(($AO10<>\"DI\"),\"np\",IF($R10<>\"\",IFERROR(0.1123*($R10),\"<\"),IF($S10<>\"\",IFERROR(0.1152305*($S10),\"<\"),\"\")))","v":11.23},{"$f":"IF(($AO10<>\"DI\"),\"np\",IF($R10<>\"\",IFERROR(0.06836*($R10),\"<\"),IF($S10<>\"\",IFERROR(0.07014028*($S10),\"<\"),\"\")))","v":6.8360000000000003},null,null,null,null,null,null,null,null,null,0.2,20,0,0,0,0,0,0,0,0,0,0,0,0,0,0,0,0,0,0,0,0,0,null,0,1.9600000000000003E-2,0.17579999999999998,1.6406000000000003,9.4725999999999999,4.4922000000000004,0,0,0,0.31260000000000004,0.27340000000000003,2.246,1.3672000000000002,0,null,0,0,0,0,0,0]
[null,null,null,null,null,null,null,null,null,null,null,null,null,null,null,null,null,"<50",null,null,null,null,null,null,null,null,null,null,null,null,null,null,null,null,null,null,null,null,null,null,"DI",null,"<","<","<","<","<",null,null,null,"<","<","<","<",null,null,null,null,null,null,null,null,null,0.2,"<",0,0,0,0,0,0,0,0,0,0,0,0,0,0,0,0,0,0,0,0,0,null,0,"<","<","<","<","<",0,0,0,"<","<","<","<",0,null,0,0,0,0,0,0]
[null,null,null,null,null,null,null,null,null,null,null,null,null,null,null,null,null,null,"<50",null,null,null,null,null,null,null,null,null,null,null,null,null,null,null,null,null,null,null,null,null,"DI",null,"<","<","<","<","<",null,null,null,"<","<","<","<",null,null,null,null,null,null,null,null,null,0.2,0,"<",0,0,0,0,0,0,0,0,0,0,0,0,0,0,0,0,0,0,0,0,null,0,"<","<","<","<","<",0,0,0,"<","<","<","<",0,null,0,0,0,0,0,0]
[null,null,null,null,null,null,null,null,null,null,null,null,null,null,null,null,null,null,null,null,null,null,null,null,null,null,null,null,null,null,null,null,null,null,null,null,null,null,null,null,"DI",null,"","","","","",null,null,null,"","","","",null,null,null,null,null,null,null,null,null,0.2,0,0,0,0,0,0,0,0,0,0,0,0,0,0,0,0,0,0,0,0,0,0,null,0,"<","<","<","<","<",0,0,0,"<","<","<","<",0,null,0,0,0,0,0,0]
[null,null,null,null,null,null,null,null,null,null,null,null,null,null,null,null,null,null,null,null,null,null,null,null,null,null,null,null,null,null,null,null,null,null,null,null,null,null,null,null,"DI",null,"","","","","",null,null,null,"","","","",null,null,null,null,null,null,null,null,null,0.2,0,0,0,0,0,0,0,0,0,0,0,0,0,0,0,0,0,0,0,0,0,0,null,0,"<","<","<","<","<",0,0,0,"<","<","<","<",0,null,0,0,0,0,0,0]
[null,null,null,null,null,null,null,null,null,null,null,null,null,null,null,null,null,null,null,null,null,null,null,null,null,null,null,null,null,null,null,null,null,null,null,null,null,null,null,null,"DI",null,"","","","","",null,null,null,"","","","",null,null,null,null,null,null,null,null,null,0.2,0,0,0,0,0,0,0,0,0,0,0,0,0,0,0,0,0,0,0,0,0,0,null,0,"<","<","<","<","<",0,0,0,"<","<","<","<",0,null,0,0,0,0,0,0]
[null,null,null,null,null,null,null,null,null,null,null,null,null,null,null,null,null,null,null,null,null,null,null,null,null,null,null,null,null,null,null,null,null,null,null,null,null,null,null,null,"autre ou ?",null,"np","np","np","np","np",null,null,null,"np","np","np","np",null,null,null,null,null,null,null,null,null,0.2,0,0,0,0,0,0,0,0,0,0,0,0,0,0,0,0,0,0,0,0,0,0,null,0,"np","np","np","np","np",0,0,0,"np","np","np","np",0,null,0,0,0,0,0,0]
[null,null,null,null,null,null,null,null,null,null,null,null,null,null,null,null,null,null,null,null,null,null,null,null,null,null,null,null,null,null,null,null,null,null,null,null,null,null,null,null,"DI",null,"","","","","",null,null,null,"","","","",null,null,null,null,null,null,null,null,null,0.2,0,0,0,0,0,0,0,0,0,0,0,0,0,0,0,0,0,0,0,0,0,0,null,0,"<","<","<","<","<",0,0,0,"<","<","<","<",0,null,0,0,0,0,0,0]
[null,null,null,null,null,null,null,null,null,null,null,null,null,null,null,null,null,null,null,null,null,null,null,null,null,null,null,null,null,null,null,null,null,null,null,null,null,null,null,null,null,null,"np","np","np","np","np",null,null,null,"np","np","np","np",null,null,null,null,null,null,null,null,null,0.2,0,0,0,0,0,0,0,0,0,0,0,0,0,0,0,0,0,0,0,0,0,0,null,0,"np","np","np","np","np",0,0,0,"np","np","np","np",0,null,0,0,0,0,0,0]
[null,"Autre zone suspecte:"]
[null,null,null,null,null,null,null,null,null,null,null,null,null,null,null,null,null,null,null,null,null,null,null,null,null,null,null,null,null,null,null,null,null,null,null,null,null,null,null,null,"autre ou ?",null,{"$f":"IF(($AO20<>\"DI\"),\"np\",IF($R20<>\"\",IFERROR(0.00098*($R20),\"<\"),IF($S20<>\"\",IFERROR(0.001002*($S20),\"<\"),\"\")))","v":"np"},{"$f":"IF(($AO20<>\"DI\"),\"np\",IF($R20<>\"\",IFERROR(0.00879*($R20),\"<\"),IF($S20<>\"\",IFERROR(0.00901804*($S20),\"<\"),\"\")))","v":"np"},{"$f":"IF(($AO20<>\"DI\"),\"np\",IF($R20<>\"\",IFERROR(0.08203*($R20),\"<\"),IF($S20<>\"\",IFERROR(0.08416834*($S20),\"<\"),\"\")))","v":"np"},{"$f":"IF(($AO20<>\"DI\"),\"np\",IF($R20<>\"\",IFERROR(0.47363*($R20),\"<\"),IF($S20<>\"\",IFERROR(0.4859719*($S20),\"<\"),\"\")))","v":"np"},{"$f":"IF(($AO20<>\"DI\"),\"np\",IF($R20<>\"\",IFERROR(0.22461*($R20),\"<\"),IF($S20<>\"\",IFERROR(0.2304609*($S20),\"<\"),\"\")))","v":"np"},null,null,null,{"$f":"IF(($AO20<>\"DI\"),\"np\",IF($R20<>\"\",IFERROR(0.01563*($R20),\"<\"),IF($S20<>\"\",IFERROR(0.01603206*($S20),\"<\"),\"\")))","v":"np"},{"$f":"IF(($AO20<>\"DI\"),\"np\",IF($R20<>\"\",IFERROR(0.01367*($R20),\"<\"),IF($S20<>\"\",IFERROR(0.01402806*($S20),\"<\"),\"\")))","v":"np"},{"$f":"IF(($AO20<>\"DI\"),\"np\",IF($R20<>\"\",IFERROR(0.1123*($R20),\"<\"),IF($S20<>\"\",IFERROR(0.1152305*($S20),\"<\"),\"\")))","v":"np"},{"$f":"IF(($AO20<>\"DI\"),\"np\",IF($R20<>\"\",IFERROR(0.06836*($R20),\"<\"),IF($S20<>\"\",IFERROR(0.07014028*($S20),\"<\"),\"\")))","v":"np"},null,null,null,null,null,null,null,null,null,0.5,{"$f":"IFERROR($BL20*R20,\"<\")","v":0},0,0,0,0,0,0,0,0,0,0,0,0,0,0,0,0,0,0,0,0,0,null,{"$f":"IFERROR($BL20*AP20,\"<\")","v":0},{"$f":"IF(($AO20=\"DI\"),IFERROR($BL20*AQ20,\"<\"),\"np\")","v":"np"},"np","np","np","np",{"$f":"$BL20*AV20","v":0},0,0,{"$f":"IF(($AO20=\"DI\"),IFERROR($BL20*AY20,\"<\"),\"np\")","v":"np"},"np","np","np",{"$f":"$BL20*BC20","v":0},null,{"$f":"IFERROR($BL20*BD20,\"<\")","v":0},0,0,0,0,0]
[null,null,null,null,null,null,null,null,null,null,null,null,null,null,null,null,null,null,null,null,null,null,null,null,null,null,null,null,null,null,null,null,null,null,null,null,null,null,null,null,"autre ou ?",null,{"$f":"IF(($AO21<>\"DI\"),\"np\",IF($R21<>\"\",IFERROR(0.00098*($R21),\"<\"),IF($S21<>\"\",IFERROR(0.001002*($S21),\"<\"),\"\")))","v":"np"},{"$f":"IF(($AO21<>\"DI\"),\"np\",IF($R21<>\"\",IFERROR(0.00879*($R21),\"<\"),IF($S21<>\"\",IFERROR(0.00901804*($S21),\"<\"),\"\")))","v":"np"},{"$f":"IF(($AO21<>\"DI\"),\"np\",IF($R21<>\"\",IFERROR(0.08203*($R21),\"<\"),IF($S21<>\"\",IFERROR(0.08416834*($S21),\"<\"),\"\")))","v":"np"},{"$f":"IF(($AO21<>\"DI\"),\"np\",IF($R21<>\"\",IFERROR(0.47363*($R21),\"<\"),IF($S21<>\"\",IFERROR(0.4859719*($S21),\"<\"),\"\")))","v":"np"},{"$f":"IF(($AO21<>\"DI\"),\"np\",IF($R21<>\"\",IFERROR(0.22461*($R21),\"<\"),IF($S21<>\"\",IFERROR(0.2304609*($S21),\"<\"),\"\")))","v":"np"},null,null,null,{"$f":"IF(($AO21<>\"DI\"),\"np\",IF($R21<>\"\",IFERROR(0.01563*($R21),\"<\"),IF($S21<>\"\",IFERROR(0.01603206*($S21),\"<\"),\"\")))","v":"np"},{"$f":"IF(($AO21<>\"DI\"),\"np\",IF($R21<>\"\",IFERROR(0.01367*($R21),\"<\"),IF($S21<>\"\",IFERROR(0.01402806*($S21),\"<\"),\"\")))","v":"np"},{"$f":"IF(($AO21<>\"DI\"),\"np\",IF($R21<>\"\",IFERROR(0.1123*($R21),\"<\"),IF($S21<>\"\",IFERROR(0.1152305*($S21),\"<\"),\"\")))","v":"np"},{"$f":"IF(($AO21<>\"DI\"),\"np\",IF($R21<>\"\",IFERROR(0.06836*($R21),\"<\"),IF($S21<>\"\",IFERROR(0.07014028*($S21),\"<\"),\"\")))","v":"np"},null,null,null,null,null,null,null,null,null,0.5,{"$f":"IFERROR($BL21*R21,\"<\")","v":0},{"$f":"IFERROR($BL21*S21,\"<\")","v":0},{"$f":"IFERROR($BL21*T21,\"<\")","v":0},{"$f":"IFERROR($BL21*U21,\"<\")","v":0},{"$f":"IFERROR($BL21*V21,\"<\")","v":0},{"$f":"IFERROR($BL21*W21,\"<\")","v":0},{"$f":"IFERROR($BL21*X21,\"<\")","v":0},{"$f":"IFERROR($BL21*Y21,\"<\")","v":0},{"$f":"IFERROR($BL21*Z21,\"<\")","v":0},{"$f":"IFERROR($BL21*AA21,\"<\")","v":0},{"$f":"IFERROR($BL21*AB21,\"<\")","v":0},{"$f":"IFERROR($BL21*AC21,\"<\")","v":0},{"$f":"IFERROR($BL21*AD21,\"<\")","v":0},{"$f":"IFERROR($BL21*AE21,\"<\")","v":0},{"$f":"IFERROR($BL21*AF21,\"<\")","v":0},{"$f":"IFERROR($BL21*AG21,\"<\")","v":0},{"$f":"IFERROR($BL21*AH21,\"<\")","v":0},{"$f":"IFERROR($BL21*AI21,\"<\")","v":0},{"$f":"IFERROR($BL21*AJ21,\"<\")","v":0},{"$f":"IFERROR($BL21*AK21,\"<\")","v":0},{"$f":"IFERROR($BL21*AL21,\"<\")","v":0},{"$f":"IFERROR($BL21*AM21,\"<\")","v":0},null,{"$f":"IFERROR($BL21*AP21,\"<\")","v":0},"np","np","np","np","np",0,0,0,"np","np","np","np",{"$f":"$BL21*BC21","v":0},null,{"$f":"IFERROR($BL21*BD21,\"<\")","v":0},{"$f":"IFERROR($BL21*BE21,\"<\")","v":0},{"$f":"IFERROR($BL21*BF21,\"<\")","v":0},{"$f":"IFERROR($BL21*BG21,\"<\")","v":0},{"$f":"IFERROR($BL21*BH21,\"<\")","v":0},{"$f":"IFERROR($BL21*BI21,\"<\")","v":0}]
[null,"Autre zone suspecte:"]
[null,null,null,null,null,null,null,null,null,null,null,null,null,null,null,null,null,null,null,null,null,null,null,null,null,null,null,null,null,null,null,null,null,null,null,null,null,null,null,null,null,null,{"$f":"IF(($AO23<>\"DI\"),\"np\",IF($R23<>\"\",IFERROR(0.00098*($R23),\"<\"),IF($S23<>\"\",IFERROR(0.001002*($S23),\"<\"),\"\")))","v":"np"},{"$f":"IF(($AO23<>\"DI\"),\"np\",IF($R23<>\"\",IFERROR(0.00879*($R23),\"<\"),IF($S23<>\"\",IFERROR(0.00901804*($S23),\"<\"),\"\")))","v":"np"},{"$f":"IF(($AO23<>\"DI\"),\"np\",IF($R23<>\"\",IFERROR(0.08203*($R23),\"<\"),IF($S23<>\"\",IFERROR(0.08416834*($S23),\"<\"),\"\")))","v":"np"},{"$f":"IF(($AO23<>\"DI\"),\"np\",IF($R23<>\"\",IFERROR(0.47363*($R23),\"<\"),IF($S23<>\"\",IFERROR(0.4859719*($S23),\"<\"),\"\")))","v":"np"},{"$f":"IF(($AO23<>\"DI\"),\"np\",IF($R23<>\"\",IFERROR(0.22461*($R23),\"<\"),IF($S23<>\"\",IFERROR(0.2304609*($S23),\"<\"),\"\")))","v":"np"},null,null,null,{"$f":"IF(($AO23<>\"DI\"),\"np\",IF($R23<>\"\",IFERROR(0.01563*($R23),\"<\"),IF($S23<>\"\",IFERROR(0.01603206*($S23),\"<\"),\"\")))","v":"np"},{"$f":"IF(($AO23<>\"DI\"),\"np\",IF($R23<>\"\",IFERROR(0.01367*($R23),\"<\"),IF($S23<>\"\",IFERROR(0.01402806*($S23),\"<\"),\"\")))","v":"np"},{"$f":"IF(($AO23<>\"DI\"),\"np\",IF($R23<>\"\",IFERROR(0.1123*($R23),\"<\"),IF($S23<>\"\",IFERROR(0.1152305*($S23),\"<\"),\"\")))","v":"np"},{"$f":"IF(($AO23<>\"DI\"),\"np\",IF($R23<>\"\",IFERROR(0.06836*($R23),\"<\"),IF($S23<>\"\",IFERROR(0.07014028*($S23),\"<\"),\"\")))","v":"np"},null,null,null,null,null,null,null,null,null,0.5,{"$f":"IFERROR($BL23*R23,\"<\")","v":0},{"$f":"IFERROR($BL23*S23,\"<\")","v":0},{"$f":"IFERROR($BL23*T23,\"<\")","v":0},{"$f":"IFERROR($BL23*U23,\"<\")","v":0},{"$f":"IFERROR($BL23*V23,\"<\")","v":0},{"$f":"IFERROR($BL23*W23,\"<\")","v":0},{"$f":"IFERROR($BL23*X23,\"<\")","v":0},null,{"$f":"IFERROR($BL23*Z23,\"<\")","v":0},{"$f":"IFERROR($BL23*AA23,\"<\")","v":0},{"$f":"IFERROR($BL23*AB23,\"<\")","v":0},{"$f":"IFERROR($BL23*AC23,\"<\")","v":0},{"$f":"IFERROR($BL23*AD23,\"<\")","v":0},{"$f":"IFERROR($BL23*AE23,\"<\")","v":0},{"$f":"IFERROR($BL23*AF23,\"<\")","v":0},{"$f":"IFERROR($BL23*AG23,\"<\")","v":0},{"$f":"IFERROR($BL23*AH23,\"<\")","v":0},{"$f":"IFERROR($BL23*AI23,\"<\")","v":0},{"$f":"IFERROR($BL23*AJ23,\"<\")","v":0},{"$f":"IFERROR($BL23*AK23,\"<\")","v":0},{"$f":"IFERROR($BL23*AL23,\"<\")","v":0},{"$f":"IFERROR($BL23*AM23,\"<\")","v":0},null,{"$f":"IFERROR($BL23*AP23,\"<\")","v":0},{"$f":"IF(($AO23=\"DI\"),IFERROR($BL23*AQ23,\"<\"),\"np\")","v":"np"},"np","np","np","np",{"$f":"$BL23*AV23","v":0},0,0,{"$f":"IF(($AO23=\"DI\"),IFERROR($BL23*AY23,\"<\"),\"np\")","v":"np"},"np","np","np",{"$f":"$BL23*BC23","v":0},null,{"$f":"IFERROR($BL23*BD23,\"<\")","v":0},{"$f":"IFERROR($BL23*BE23,\"<\")","v":0},{"$f":"IFERROR($BL23*BF23,\"<\")","v":0},{"$f":"IFERROR($BL23*BG23,\"<\")","v":0},{"$f":"IFERROR($BL23*BH23,\"<\")","v":0},{"$f":"IFERROR($BL23*BI23,\"<\")","v":0}]
[null,null,null,null,null,null,null,null,null,null,null,null,null,null,null,null,null,null,null,null,null,null,null,null,null,null,null,null,null,null,null,null,null,null,null,null,null,null,null,null,null,null,{"$f":"IF(($AO24<>\"DI\"),\"np\",IF($R24<>\"\",IFERROR(0.00098*($R24),\"<\"),IF($S24<>\"\",IFERROR(0.001002*($S24),\"<\"),\"\")))","v":"np"},{"$f":"IF(($AO24<>\"DI\"),\"np\",IF($R24<>\"\",IFERROR(0.00879*($R24),\"<\"),IF($S24<>\"\",IFERROR(0.00901804*($S24),\"<\"),\"\")))","v":"np"},{"$f":"IF(($AO24<>\"DI\"),\"np\",IF($R24<>\"\",IFERROR(0.08203*($R24),\"<\"),IF($S24<>\"\",IFERROR(0.08416834*($S24),\"<\"),\"\")))","v":"np"},{"$f":"IF(($AO24<>\"DI\"),\"np\",IF($R24<>\"\",IFERROR(0.47363*($R24),\"<\"),IF($S24<>\"\",IFERROR(0.4859719*($S24),\"<\"),\"\")))","v":"np"},{"$f":"IF(($AO24<>\"DI\"),\"np\",IF($R24<>\"\",IFERROR(0.22461*($R24),\"<\"),IF($S24<>\"\",IFERROR(0.2304609*($S24),\"<\"),\"\")))","v":"np"},null,null,null,{"$f":"IF(($AO24<>\"DI\"),\"np\",IF($R24<>\"\",IFERROR(0.01563*($R24),\"<\"),IF($S24<>\"\",IFERROR(0.01603206*($S24),\"<\"),\"\")))","v":"np"},{"$f":"IF(($AO24<>\"DI\"),\"np\",IF($R24<>\"\",IFERROR(0.01367*($R24),\"<\"),IF($S24<>\"\",IFERROR(0.01402806*($S24),\"<\"),\"\")))","v":"np"},{"$f":"IF(($AO24<>\"DI\"),\"np\",IF($R24<>\"\",IFERROR(0.1123*($R24),\"<\"),IF($S24<>\"\",IFERROR(0.1152305*($S24),\"<\"),\"\")))","v":"np"},{"$f":"IF(($AO24<>\"DI\"),\"np\",IF($R24<>\"\",IFERROR(0.06836*($R24),\"<\"),IF($S24<>\"\",IFERROR(0.07014028*($S24),\"<\"),\"\")))","v":"np"},null,null,null,null,null,null,null,null,null,0.5,{"$f":"IFERROR($BL24*R24,\"<\")","v":0},0,0,0,0,0,0,null,{"$f":"IFERROR($BL24*Z24,\"<\")","v":0},0,0,0,0,0,0,0,0,0,0,0,0,0,null,{"$f":"IFERROR($BL24*AP24,\"<\")","v":0},"np","np","np","np","np",0,0,0,"np","np","np","np",{"$f":"$BL24*BC24","v":0},null,{"$f":"IFERROR($BL24*BD24,\"<\")","v":0},0,0,0,0,0]
[null,"Légende",null,null,null,null,null,null,null,null,null,null,null,null,null,null,null,null,null,null,null,null,null,null,null,null,null,null,null,null,null,null,null,null,null,null,null,null,null,null,null,null,null,null,null,null,null,null,null,null,null,null,null,null,null,null,null,null,null,null,null,null,null,null,null,null,null,null,null,null,null,null,null,null,null,null,null,null,null,null,null,null,null,null,null,null,null,null,null,null,null,null,null,null,null,null,null,null,null,null,null,null,{"$f":"$BL25*BD25","v":0},0,0,0,0,0]
[null,"Caractère gras et rouge= excède la  ",null,null,null,null,null,"usage DS(6)",null,null,"I",null,null,null,null,"VS(3)",null,{"$f":"INDEX(R$52:R$56,MATCH($K$26,$P$52:$P$56,0))","v":"-"},"-",6,21,75,75,650,650,"-","-","-","-","-","-","-","-","-","-","-","-","-","-",null,null,{"$f":"INDEX(AP$52:AP$56,MATCH($K$26,$P$52:$P$56,0))","v":"-"},"-","-","-","-","-","-","-","-","-","-","-","-","-",0.1,4,0.3,1,1.5,2.5,null,null,null,{"$f":"R26","v":"-"},"-",6,21,75,75,650,650,"-","-","-","-","-","-","-","-","-","-","-","-","-","-",null,{"$f":"AP26","v":"-"},"-","-","-","-","-","-","-","-","-","-","-","-","-",null,{"$f":"BD26","v":0.1},4,0.3,1,1.5,2.5]
[null,"Caractère souligné = excède la  ",null,null,null,null,null,"usage DS(6)",null,null,"IV",null,null,null,null,"VSH(3)",null,{"$f":"INDEX(R$61:R$65,MATCH($K$27,$P$61:$P$65,0))","v":"-"},"-",6,1330.42,34559.43,34592.86,48464.75,48464.75,411.7,"-",50010,50150,50170,"-","-",0.7,125,406.7,20030,20060,15050,15050,null,null,{"$f":"Z27","v":411.7},"-",50010,50150,50170,"-","-",0.7,125,406.7,20030,20060,15050,15050,{"$f":"INDEX(BD$61:BD$65,MATCH($K$27,$P$61:$P$65,0))","v":0.7},125,3.21,74.94,43.48,29.56,null,null,null,null,null,6,1330.42,34559.43,34592.86,48464.75,48464.75,411.7,"-",50010,50150,50170,"-","-",0.7,125,406.7,20030,20060,15050,15050,null,{"$f":"BU27","v":411.7},"-",50010,50150,50170,"-","-",0.7,125,406.7,20030,20060,15050,15050,null,0.7,125,3.21,74.94,43.48,29.56]
[null,null,null,null,null,null,null,"usage DS(6)",null,null,"III",null,null,null,null,"VSN(3)",null,{"$f":"INDEX(R$125:R$129,MATCH($K$28,$P$125:$P$129,0))","v":"-"},"-",6,149,577,5393,302208,1000000,"-","-","-","-","-","-","-","-","-","-","-","-","-","-",null,null,{"$f":"INDEX(AP$125:AP$129,MATCH($K$28,$P$125:$P$129,0))","v":"-"},"-","-","-","-","-","-","-","-","-","-","-","-","-",0.2,7.1,6,7.9,1.5,2.5,null,null,null,null,null,6,149,577,5393,302208,1000000,"-","-","-","-","-","-","-","-","-","-","-","-","-","-",null,"-","-","-","-","-","-","-","-","-","-","-","-","-","-",null,0.2,7.1,6,7.9,1.5,2.5]
[null,null,null,null,null,null,null,null,null,null,null,null,null,null,null,"VSN-aj(3) (5)",null,null,null,null,null,null,null,null,null,null,null,null,null,null,null,null,null,null,null,null,null,null,null,null,null,{"$f":"Z29","v":0},0,0,0,0,0,0,0,0,0,0,0,0,0,null,null,null,null,null,null,null,null,null,null,null,0,0,0,0,0,0,0,0,0,0,0,0,0,0,0,0,0,0,0,0,null,0,0,0,0,0,0,0,0,0,0,0,0,0,0,null,0,0,0,0,0,0]
[null,null,null,null,null,null,null,"usage DS(6)",null,null,"III",null,null,null,null,"VLN(3)",null,{"$f":"INDEX(R$135:R$139,MATCH($K$30,$P$135:$P$139,0))","v":"-"},"-",12,298,1154,10786,604416,1000000,"-","-","-","-","-","-","-","-","-","-","-","-","-","-",null,null,{"$f":"INDEX(AP$135:AP$139,MATCH($K$30,$P$135:$P$139,0))","v":"-"},"-","-","-","-","-","-","-","-","-","-","-","-","-",1,59,30,34,6.18,17,null,null,null,null,null,12,298,1154,10786,604416,1000000,"-","-","-","-","-","-","-","-","-","-","-","-","-","-",null,"-","-","-","-","-","-","-","-","-","-","-","-","-","-",null,1,59,30,34,6.18,17]
[null,null,null,null,null,null,null,null,null,null,null,null,null,null,null,"VLN-aj(3) (5)",null,null,null,null,null,null,null,null,null,null,null,null,null,null,null,null,null,null,null,null,null,null,null,null,null,{"$f":"Z31","v":0},0,0,0,0,0,0,0,0,0,0,0,0,0,null,null,null,null,null,null,null,null,null,null,null,0,0,0,0,0,0,0,0,0,0,0,0,0,0,0,0,0,0,0,0,null,0,0,0,0,0,0,0,0,0,0,0,0,0,0,null,0,0,0,0,0,0]
[null,"Fond pointillé = excède la",null,null,null,null,null,"usage (DS)(4) (6)",null,null,"III",null,null,null,null,"VSE(3)",null,{"$f":"INDEX(R$75:R$77,MATCH($K$32,$P$75:$P$77,0))","v":"-"},"-",105,105,75,75,650,650,"-","-","-","-","-","-","-","-","-","-","-","-","-","-",null,null,{"$f":"INDEX(AP$75:AP$77,MATCH($K$32,$P$75:$P$77,0))","v":"-"},"-","-","-","-","-","-","-","-","-","-","-","-","-",14,8.5,12,2,8,7.2,null,null,null,null,null,{"$f":"T32","v":105},105,75,75,650,650,"-","-","-","-","-","-","-","-","-","-","-","-","-","-",null,{"$f":"BU32","v":"-"},"-","-","-","-","-","-","-","-","-","-","-","-","-",null,{"$f":"BD32","v":14},8.5,12,2,8,7.2]
[null,"Fond jaune = excède le",null,null,null,null,null,"MCS applicable(6)",null,null,"LIMON MCS-2",null,null,null,null,"BOF-SRA(3)",null,{"$f":"INDEX(R$85:R$119,MATCH($K$33,$P$85:$P$119,0))","v":7800},{"$f":"INDEX(S$85:S$119,MATCH($K$33,$P$85:$P$119,0))","v":7600},null,{"$f":"INDEX(U$85:U$119,MATCH($K$33,$P$85:$P$119,0))","v":190},{"$f":"INDEX(V$85:V$119,MATCH($K$33,$P$85:$P$119,0))","v":740},null,null,null,{"$f":"INDEX(Z$85:Z$119,MATCH($K$33,$P$85:$P$119,0))","v":"-"},7.625,68.625,640.5,3698.125,1753.75,"-","-","-",122,106.75,876.875,533.75,"-",null,null,"-",7.625,68.625,640.5,3698.125,1753.75,"-","-","-",122,106.75,876.875,533.75,"-",{"$f":"INDEX(BD$85:BD$119,MATCH($K$33,$P$85:$P$119,0))","v":0.31},36.1,1.33,21.09,19,11.4,null,null,null,{"$f":"R33","v":7800},{"$f":"S33","v":7600},0,190,740,0,0,0,"-",7.625,68.625,640.5,3698.125,1753.75,"-","-","-",122,106.75,876.875,533.75,"-",null,"-",7.625,68.625,640.5,3698.125,1753.75,"-","-","-",122,106.75,876.875,533.75,"-",null,0.31,36.1,1.33,21.09,19,11.4]
[null,"(1) ESS = essence; DI = diesel; HA = hydrocarbures aromatiques ; MC = mazout de chauffage ; AU = autre"]
[null,"(2) Blanc (vide) = néant ; * = léger ; ** = moyen ; *** = fort ou valeur PID mesurée - il n'est pas nécessaire d'indiquer en même temps les perceptions organoleptiques et la réaction huile/eau qui n'est pas strictement nécessaire"]
[null,"(3) A adapter conformément à la législation et aux paramètres spécifiques au site"]
[null,"(4) Voir le GRER (partie D) pour l'applicabilité et les dérogations"]
[null,"(5) A calculer selon le GRER (partie C - annexe C2)"]
[null,"(6) Liste déroulante"]
[null,"(7) Dans le cas de diesel (\"DI\"), il convient de procéder à l'évaluation (vis-a-vis des VSH ou du BOF_SRA) sur base de la \"répartition standard diesel\" ; dans les autres cas (polluant autre que \"DI\"), il n'y a pas lieu de procéder à cette évaluation"]
[null,null,null,null,null,null,null,null,null,null,null,null,null,null,null,null,null,null,null,null,null,null,null,null,null,null,null,null,null,null,null,null,null,null,null,null,null,null,null,null,"DI"]
[null,null,null,null,null,null,null,"EO","TN",null,null,"ESS",null,"oui",null,null,null,null,null,null,null,null,null,null,null,null,null,null,null,null,null,null,null,null,null,null,null,null,null,null,"autre ou ?"]
[null,null,null,null,null,"Oui",null,"EC","R",null,null,"DI",null,"non"]
[null,null,null,null,null,null,null,"PA","non défini",null,null,"HA"]
[null,null,null,null,null,null,null,"EF",null,null,null,"MC"]
[null,null,null,null,null,null,null,"MON",null,null,null,"AU"]
[null,null,null,null,null,null,null,"EI"]
[null,null,null,null,null,null,null,"autre / non défini"]
[]
[null,null,null,null,null,null,null,null,null,null,null,null,null,null,"VS (DS)","usage",null,"conc. en mg/kg ms"]
[null,null,null,null,null,null,null,null,null,null,null,null,null,null,null,null,null,"Huile minérale \nEC5-35","Huile minérale \nEC10-40","Fraction\nEC 5-8","Fraction\nEC >8-10","Fraction\nEC >10-12","Fraction\nEC >12-16","Fraction\nEC >16-21","Fraction\nEC >21-35","ALI\nEC 5-6","ALI\nEC >6-8","ALI\nEC >8-10","ALI\nEC >10-12","ALI\nEC >12-16","ALI\nEC >16-21","ALI\nEC >21-35","Arom\nEC 6-7","Arom\nEC >7-8","Arom\nEC >8-10","Arom\nEC >10-12","Arom\nEC >12-16","Arom\nEC >16-21","Arom\nEC >21-35",null,null,"ALI\nEC 5-6","ALI\nEC >6-8","ALI\nEC >8-10","ALI\nEC >10-12","ALI\nEC >12-16","ALI\nEC >16-21","ALI\nEC >21-35","Arom\nEC 6-7","Arom\nEC >7-8","Arom\nEC >8-10","Arom\nEC >10-12","Arom\nEC >12-16","Arom\nEC >16-21","Arom\nEC >21-35","Benzène","Toluène","Ethylbenzène","Xylènes (somme)","MTBE","Naphtalène"]
[null,null,null,null,null,null,null,null,null,null,null,null,null,null,null,"I",null,"-","-",6,21,75,75,650,650,"-","-","-","-","-","-","-","-","-","-","-","-","-","-",null,null,{"$f":"Z52","v":"-"},{"$f":"AA52","v":"-"},"-","-","-","-","-","-","-","-","-","-","-","-",0.1,4,0.3,1,1.5,2.5]
[null,null,null,null,null,null,null,null,null,null,null,null,null,null,null,"II",null,"-","-",6,21,75,75,650,650,"-","-","-","-","-","-","-","-","-","-","-","-","-","-",null,null,{"$f":"Z53","v":"-"},"-","-","-","-","-","-","-","-","-","-","-","-","-",0.1,4,0.3,1,1.5,2.5]
[null,null,null,null,null,null,null,null,null,null,null,null,null,null,null,"III",null,"-","-",6,21,75,75,650,650,"-","-","-","-","-","-","-","-","-","-","-","-","-","-",null,null,{"$f":"Z54","v":"-"},"-","-","-","-","-","-","-","-","-","-","-","-","-",0.1,7,0.3,2,1.5,2.5]
[null,null,null,null,null,null,null,null,null,null,null,null,null,null,null,"IV",null,"-","-",6,150,580,750,1250,2100,"-","-","-","-","-","-","-","-","-","-","-","-","-","-",null,null,{"$f":"Z55","v":"-"},"-","-","-","-","-","-","-","-","-","-","-","-","-",0.2,7,3,8,1.5,2.5]
[null,null,null,null,null,null,null,null,null,null,null,null,null,null,null,"V",null,"-","-",9,600,600,920,2700,5300,"-","-","-","-","-","-","-","-","-","-","-","-","-","-",null,null,{"$f":"Z56","v":"-"},"-","-","-","-","-","-","-","-","-","-","-","-","-",0.2,22,3,30,2,6.3]
[]
[]
[null,null,null,null,null,null,null,null,null,null,null,null,null,null,"VSH (GRER v04)","usage",null,"conc. en mg/kg ms"]
[null,null,null,null,null,null,null,null,null,null,null,null,null,null,null,null,null,"Huile minérale \nEC5-35","Huile minérale \nEC10-40","Fraction\nEC 5-8","Fraction\nEC >8-10","Fraction\nEC >10-12","Fraction\nEC >12-16","Fraction\nEC >16-21","Fraction\nEC >21-35","ALI\nEC 5-6","ALI\nEC >6-8","ALI\nEC >8-10","ALI\nEC >10-12","ALI\nEC >12-16","ALI\nEC >16-21","ALI\nEC >21-35","Arom\nEC 6-7","Arom\nEC >7-8","Arom\nEC >8-10","Arom\nEC >10-12","Arom\nEC >12-16","Arom\nEC >16-21","Arom\nEC >21-35",null,null,"ALI\nEC 5-6","ALI\nEC >6-8","ALI\nEC >8-10","ALI\nEC >10-12","ALI\nEC >12-16","ALI\nEC >16-21","ALI\nEC >21-35","Arom\nEC 6-7","Arom\nEC >7-8","Arom\nEC >8-10","Arom\nEC >10-12","Arom\nEC >12-16","Arom\nEC >16-21","Arom\nEC >21-35","Benzène","Toluène","Ethylbenzène","Xylènes (somme)","MTBE","Naphtalène"]
[null,null,null,null,null,null,null,null,null,null,null,null,null,null,null,"I",null,"-","-",953.96,38941.65,34559.43,34592.86,48464.75,48464.75,"-","-",50010,50150,50170,"-","-",143.6,50050,25680,20030,20060,15050,15050,null,null,{"$f":"Z61","v":"-"},"-",50010,50150,50170,"-","-",143.6,50050,25680,20030,20060,15050,15050,143.6,50050,1930,125600,7378,278100]
[null,null,null,null,null,null,null,null,null,null,null,null,null,null,null,"II",null,"-","-",6,24,111.69,1002.14,7890.64,5538.72,36.31,90.83,21.78,111.6,8191,178000,9753,0.1,9.16,29.86,111.9,328.8,2443,2758,null,null,36.31,90.83,21.78,111.6,8191,178000,9753,0.1,9.16,29.86,111.9,328.8,2443,2758,0.1,9.16,0.32,6.36,1.51,3.72]
[null,null,null,null,null,null,null,null,null,null,null,null,null,null,null,"III",null,"-","-",6,24.03,116.43,1726.81,8582.4,9369.0300000000007,36.340000000000003,90.87,21.8,111.8,8757,194000,194100,0.1,9.75,31.57,128.9,601,2657,2909,null,null,36.340000000000003,90.87,21.8,111.8,8757,194000,194100,0.1,9.75,31.57,128.9,601,2657,2909,0.1,9.75,0.35,6.45,2.2400000000000002,3.72]
[null,null,null,null,null,null,null,null,null,null,null,null,null,null,null,"IV",null,"-","-",6,1330.42,34559.43,34592.86,48464.75,48464.75,411.7,"-",50010,50150,50170,"-","-",0.7,125,406.7,20030,20060,15050,15050,null,null,411.7,"-",50010,50150,50170,"-","-",0.7,125,406.7,20030,20060,15050,15050,0.7,125,3.21,74.94,43.48,29.56]
[null,null,null,null,null,null,null,null,null,null,null,null,null,null,null,"V",null,"-","-",9,1357.03,199867.7,208645.78,250568.98,250636.97,422.5,"-",195100,300800,304200,"-","-",0.7,126.1,409.1,112100,120400,91160,91190,null,null,422.5,"-",195100,300800,304200,"-","-",0.7,126.1,409.1,112100,120400,91160,91190,0.7,126.1,3.21,76.63,43.48,29.56]
[null,null,null,null,null,null,null,null,null,null,null,null,null,null,null,"CSAT",null,null,null,null,null,null,null,null,null,626.12,341.22,187.83,114.41,50.74,20.98,2.15,2373.06,1066.04,1391.47,841.71,388.02,137.16999999999999,11.05,null,null,626.12,341.22,187.83,114.41,50.74,20.98,2.15,2373.06,1066.04,1391.47,841.71,388.02,137.16999999999999,11.05,2373.06,1066.04,486,544.61,13645.95,597.25]
[]
[null,null,null,null,null,null,null,null,null,null,null,null,null,null,null,null,null,"en gras, les valeurs dépassent la CSAT (conc. À saturation)"]
[null,null,null,null,null,null,null,null,null,null,null,null,null,null,null,null,null,"le tiret \"-\" signifie que les concentrations dépassent le kg de polluant par kg de sol"]
[null,null,null,null,null,null,null,null,null,null,null,null,null,null,null,null,null,"valeurs surlignées en gris = VS (DS) car VSH<VS"]
[]
[]
[null,null,null,null,null,null,null,null,null,null,null,null,null,null,"VSE (GRER v04)","usage",null,"conc. en mg/kg ms"]
[null,null,null,null,null,null,null,null,null,null,null,null,null,null,null,null,null,"Huile minérale \nEC5-35","Huile minérale \nEC10-40","Fraction\nEC 5-8","Fraction\nEC >8-10","Fraction\nEC >10-12","Fraction\nEC >12-16","Fraction\nEC >16-21","Fraction\nEC >21-35","ALI\nEC 5-6","ALI\nEC >6-8","ALI\nEC >8-10","ALI\nEC >10-12","ALI\nEC >12-16","ALI\nEC >16-21","ALI\nEC >21-35","Arom\nEC 6-7","Arom\nEC >7-8","Arom\nEC >8-10","Arom\nEC >10-12","Arom\nEC >12-16","Arom\nEC >16-21","Arom\nEC >21-35",null,null,"ALI\nEC 5-6","ALI\nEC >6-8","ALI\nEC >8-10","ALI\nEC >10-12","ALI\nEC >12-16","ALI\nEC >16-21","ALI\nEC >21-35","Arom\nEC 6-7","Arom\nEC >7-8","Arom\nEC >8-10","Arom\nEC >10-12","Arom\nEC >12-16","Arom\nEC >16-21","Arom\nEC >21-35","Benzène","Toluène","Ethylbenzène","Xylènes (somme)","MTBE","Naphtalène"]
[null,null,null,null,null,null,null,null,null,null,null,null,null,null,null,"I",null,"-","-",105,105,75,75,650,650,"-","-","-","-","-","-","-","-","-","-","-","-","-","-",null,null,{"$f":"Z75","v":"-"},{"$f":"AA75","v":"-"},{"$f":"AB75","v":"-"},{"$f":"AC75","v":"-"},{"$f":"AD75","v":"-"},{"$f":"AE75","v":"-"},{"$f":"AF75","v":"-"},{"$f":"AG75","v":"-"},{"$f":"AH75","v":"-"},{"$f":"AI75","v":"-"},{"$f":"AJ75","v":"-"},{"$f":"AK75","v":"-"},{"$f":"AL75","v":"-"},{"$f":"AM75","v":"-"},11,6,7.8,1.9,6.7,3.7]
[null,null,null,null,null,null,null,null,null,null,null,null,null,null,null,"II",null,"-","-",105,105,75,75,650,650,"-","-","-","-","-","-","-","-","-","-","-","-","-","-",null,null,"-","-","-","-","-","-","-","-","-","-","-","-","-","-",6.4,3.6,4.7,1.1000000000000001,4,3.7]
[null,null,null,null,null,null,null,null,null,null,null,null,null,null,null,"III",null,"-","-",105,105,75,75,650,650,"-","-","-","-","-","-","-","-","-","-","-","-","-","-",null,null,"-","-","-","-","-","-","-","-","-","-","-","-","-","-",14,8.5,12,2,8,7.2]
[]
[]
[]
[]
[]
[null,null,null,null,null,null,null,null,null,null,null,null,null,null,"BOF_SRA","MCS"]
[null,null,null,null,null,null,null,null,null,null,null,null,null,null,null,null,null,"Huile minérale \nEC5-35","Huile minérale \nEC10-40","Fraction\nEC 5-8","Fraction\nEC >8-10","Fraction\nEC >10-12","Fraction\nEC >12-16","Fraction\nEC >16-21","Fraction\nEC >21-35","ALI\nEC 5-6","ALI\nEC >6-8","ALI\nEC >8-10","ALI\nEC >10-12","ALI\nEC >12-16","ALI\nEC >16-21","ALI\nEC >21-35","Arom\nEC 6-7","Arom\nEC >7-8","Arom\nEC >8-10","Arom\nEC >10-12","Arom\nEC >12-16","Arom\nEC >16-21","Arom\nEC >21-35",null,null,"ALI\nEC 5-6","ALI\nEC >6-8","ALI\nEC >8-10","ALI\nEC >10-12","ALI\nEC >12-16","ALI\nEC >16-21","ALI\nEC >21-35","Arom\nEC 6-7","Arom\nEC >7-8","Arom\nEC >8-10","Arom\nEC >10-12","Arom\nEC >12-16","Arom\nEC >16-21","Arom\nEC >21-35","Benzène","Toluène","Ethylbenzène","Xylènes (somme)","MTBE","Naphtalène"]
[null,null,null,null,null,null,null,null,null,null,null,null,null,null,null,"LIMON MCS-1",null,4000,3900,"-",100,390,"-","-","-","-",4,36,336,1940,920,"-","-","-",64,56,460,280,"-",null,null,{"$f":"Z85","v":"-"},{"$f":"AA85","v":4},36,336,1940,920,"-","-","-",64,56,460,280,"-",0.16200000000000001,19,0.7,11.1,10,6]
[null,null,null,null,null,null,null,null,null,null,null,null,null,null,null,"LIMON MCS-2",null,7800,7600,"-",190,740,"-","-","-","-",7.625,68.625,640.5,3698.125,1753.75,"-","-","-",122,106.75,876.875,533.75,"-",null,null,{"$f":"Z86","v":"-"},7.625,68.625,640.5,3698.125,1753.75,"-","-","-",122,106.75,876.875,533.75,"-",0.31,36.1,1.33,21.09,19,11.4]
[null,null,null,null,null,null,null,null,null,null,null,null,null,null,null,"LIMON MCS-3",null,2800,2800,"-",70,270,"-","-","-","-",2.8,25.3,236.3,1364,646.9,"-","-","-",45,39.4,323.39999999999998,196.9,"-",null,null,"-",2.8,25.3,236.3,1364,646.9,"-","-","-",45,39.4,323.39999999999998,196.9,"-",0.12,14,0.53500000000000003,8.35,7.5,4.5]
[null,null,null,null,null,null,null,null,null,null,null,null,null,null,null,"LIMON MCS-4",null,20000,19000,"-",490,1900,"-","-","-","-",19.899999999999999,179.3,1673,9662,4582,"-","-","-",318.8,278.89999999999998,2291,1395,"-",null,null,"-",19.899999999999999,179.3,1673,9662,4582,"-","-","-",318.8,278.89999999999998,2291,1395,"-",0.85,10,3.65,57,50,32]
[null,null,null,null,null,null,null,null,null,null,null,null,null,null,null,"LIMON MCS-5",null,20000,19000,"-",490,1900,"-","-","-","-",19.8,178.2,1663,9603,4554,"-","-","-",316.8,277.2,2277,1386,"-",null,null,"-",19.8,178.2,1663,9603,4554,"-","-","-",316.8,277.2,2277,1386,"-",0.81,94.5,3.7,55.5,47,29.5]
[null,null,null,null,null,null,null,null,null,null,null,null,null,null,null,"LIMON MCS-6",null,20000,20000,"-",1000,20000,"-","-","-","-",360,3240,30240,174600,82800,"-","-","-",5760,5040,41400,25200,"-",null,null,"-",360,3240,30240,174600,82800,"-","-","-",5760,5040,41400,25200,"-",14,3000,63,4000,800,540]
[null,null,null,null,null,null,null,null,null,null,null,null,null,null,null,"LIMON MCS-7",null,20000,20000,"-",1000,20000,"-","-","-","-",360,3240,30240,174600,82800,"-","-","-",5760,5040,41400,25200,"-",null,null,"-",360,3240,30240,174600,82800,"-","-","-",5760,5040,41400,25200,"-",7,840,32,475,440,260]
[null,null,null,null,null,null,null,null,null,null,null,null,null,null,null,"LIMON SABLEUX MCS-1",null,3200,3100,"-",80,310,"-","-","-","-",3.2,28.7,267.8,1546,733.1,"-","-","-",51,44.6,366.6,223.1,"-",null,null,"-",3.2,28.7,267.8,1546,733.1,"-","-","-",51,44.6,366.6,223.1,"-",0.12,13.5,0.5,7.68,7.7,4.5]
[null,null,null,null,null,null,null,null,null,null,null,null,null,null,null,"LIMON SABLEUX MCS-2",null,5400,5300,"-",130,520,"-","-","-","-",5.3,48.1,448.9,2592,1229,"-","-","-",85.5,74.8,614.5,374.1,"-",null,null,"-",5.3,48.1,448.9,2592,1229,"-","-","-",85.5,74.8,614.5,374.1,"-",0.31,36.1,1.33,21.09,19,11.4]
[null,null,null,null,null,null,null,null,null,null,null,null,null,null,null,"LIMON SABLEUX MCS-3",null,1500,1400,"-",37,140,"-","-","-","-",1.456,13.16,122.9,709.3,336.4,"-","-","-",23.4,20.49,168.2,102.4,"-",null,null,"-",1.456,13.16,122.9,709.3,336.4,"-","-","-",23.4,20.49,168.2,102.4,"-",9.9000000000000005E-2,1.1000000000000001,0.44500000000000001,6.68,6.2,3.8]
[null,null,null,null,null,null,null,null,null,null,null,null,null,null,null,"LIMON SABLEUX MCS-4",null,14000,13000,"-",340,1300,"-","-","-","-",13.78,125.1,1167,6739,3195,"-","-","-",222.3,194.5,1598,972.7,"-",null,null,"-",13.78,125.1,1167,6739,3195,"-","-","-",222.3,194.5,1598,972.7,"-",0.58499999999999996,69,2.65,40.200000000000003,36.25,22.5]
[null,null,null,null,null,null,null,null,null,null,null,null,null,null,null,"LIMON SABLEUX MCS-5",null,15000,14000,"-",370,1400,"-","-","-","-",14.85,133.69999999999999,1247,7202,3415,"-","-","-",237.6,207.9,1708,1040,"-",null,null,"-",14.85,133.69999999999999,1247,7202,3415,"-","-","-",237.6,207.9,1708,1040,"-",0.61,72.5,2.76,42,36,22.75]
[null,null,null,null,null,null,null,null,null,null,null,null,null,null,null,"LIMON SABLEUX MCS-6",null,20000,20000,"-",1000,20000,"-","-","-","-",360,3240,30240,174600,82800,"-","-","-",5760,5040,41400,25200,"-",null,null,"-",360,3240,30240,174600,82800,"-","-","-",5760,5040,41400,25200,"-",8.9,1200,40,3800,550,340]
[null,null,null,null,null,null,null,null,null,null,null,null,null,null,null,"LIMON SABLEUX MCS-7",null,20000,20000,"-",1000,20000,"-","-","-","-",360,3240,30240,174600,82800,"-","-","-",5760,5040,41400,25200,"-",null,null,"-",360,3240,30240,174600,82800,"-","-","-",5760,5040,41400,25200,"-",4.6500000000000004,550,20,290,290,160]
[null,null,null,null,null,null,null,null,null,null,null,null,null,null,null,"ARGILE MCS-1",null,9000,8700,"-",220,860,"-","-","-","-",8.8000000000000007,79.2,739.2,4268,2024,"-","-","-",140.80000000000001,123.2,1012,616,"-",null,null,"-",8.8000000000000007,79.2,739.2,4268,2024,"-","-","-",140.80000000000001,123.2,1012,616,"-",0.33,37.5,1.5,22,16,12]
[null,null,null,null,null,null,null,null,null,null,null,null,null,null,null,"ARGILE MCS-2",null,17000,16000,"-",420,1600,"-","-","-","-",16.8,151.30000000000001,1412,8154,3867,"-","-","-",269,235.4,1933,1177,"-",null,null,"-",16.8,151.30000000000001,1412,8154,3867,"-","-","-",269,235.4,1933,1177,"-",0.66,75,3,44,32,24]
[null,null,null,null,null,null,null,null,null,null,null,null,null,null,null,"ARGILE MCS-3",null,20000,5900,"-",140,580,"-","-","-","-",5.94,53.46,499,2881,1366,"-","-","-",95.04,83.16,683.1,415.8,"-",null,null,"-",5.94,53.46,499,2881,1366,"-","-","-",95.04,83.16,683.1,415.8,"-",0.22950000000000001,28,1.075,16.25,11.5,8.8000000000000007]
[null,null,null,null,null,null,null,null,null,null,null,null,null,null,null,"ARGILE MCS-4",null,20000,20000,"-",1000,4600,"-","-","-","-",47.08,423.7,3955,22830,10830,"-","-","-",753.3,659.1,5414,3296,"-",null,null,"-",47.08,423.7,3955,22830,10830,"-","-","-",753.3,659.1,5414,3296,"-",1.87,227,8.9049999999999994,132.5,95,75]
[null,null,null,null,null,null,null,null,null,null,null,null,null,null,null,"ARGILE MCS-5",null,20000,20000,"-",1000,4200,"-","-","-","-",43.56,392,3659,21130,10020,"-","-","-",697,609.79999999999995,5009,3049,"-",null,null,"-",43.56,392,3659,21130,10020,"-","-","-",697,609.79999999999995,5009,3049,"-",0.33,37.5,1.5,22,16,12]
[null,null,null,null,null,null,null,null,null,null,null,null,null,null,null,"ARGILE MCS-6",null,20000,20000,"-",1000,20000,"-","-","-","-",360,3240,30240,174600,82800,"-","-","-",5760,5040,41400,25200,"-",null,null,"-",360,3240,30240,174600,82800,"-","-","-",5760,5040,41400,25200,"-",31.5,6000,127.5,8000,1650,1050]
[null,null,null,null,null,null,null,null,null,null,null,null,null,null,null,"ARGILE MCS-7",null,20000,20000,"-",1000,20000,"-","-","-","-",360,3240,30240,174600,82800,"-","-","-",5760,5040,41400,25200,"-",null,null,"-",360,3240,30240,174600,82800,"-","-","-",5760,5040,41400,25200,"-",15.1,1725,60.3,875,819,490]
[null,null,null,null,null,null,null,null,null,null,null,null,null,null,null,"LIMON CAILLOUTEUX MCS-1",null,7800,7600,"-",190,740,"-","-","-","-",7.6,68.599999999999994,640.5,3698,1754,"-","-","-",122,106.8,876.9,533.79999999999995,"-",null,null,"-",7.6,68.599999999999994,640.5,3698,1754,"-","-","-",122,106.8,876.9,533.79999999999995,"-",0.28999999999999998,33.5,1.35,20,14,12]
[null,null,null,null,null,null,null,null,null,null,null,null,null,null,null,"LIMON CAILLOUTEUX MCS-2",null,14000,14000,"-",360,1400,"-","-","-","-",14.4,129.9,1213,7002,3321,"-","-","-",231,202.1,1660,1011,"-",null,null,"-",14.4,129.9,1213,7002,3321,"-","-","-",231,202.1,1660,1011,"-",0.48499999999999999,59.5,2.5,35,25,22.5]
[null,null,null,null,null,null,null,null,null,null,null,null,null,null,null,"LIMON CAILLOUTEUX MCS-3",null,3400,3300,"-",84,320,"-","-","-","-",3.3439999999999999,30.18,281.8,1627,771.8,"-","-","-",53.68,46.99,385.8,234.9,"-",null,null,"-",3.3439999999999999,30.18,281.8,1627,771.8,"-","-","-",53.68,46.99,385.8,234.9,"-",0.216,26.2,1.02,15,10.53,9]
[null,null,null,null,null,null,null,null,null,null,null,null,null,null,null,"LIMON CAILLOUTEUX MCS-4",null,2000,20000,"-",1000,4600,"-","-","-","-",36.49,328.4,3065,17690,8393,"-","-","-",583.79999999999995,510.8,4196,2554,"-",null,null,"-",36.49,328.4,3065,17690,8393,"-","-","-",583.79999999999995,510.8,4196,2554,"-",1.42,172.5,6.6619999999999999,102,68.5,59.5]
[null,null,null,null,null,null,null,null,null,null,null,null,null,null,null,"LIMON CAILLOUTEUX MCS-5",null,20000,20000,"-",1000,4200,"-","-","-","-",31.4,282.2,2635,15210,7214,"-","-","-",501.8,439.1,3607,2195,"-",null,null,"-",31.4,282.2,2635,15210,7214,"-","-","-",501.8,439.1,3607,2195,"-",1.2,147,5.75,87,57,49]
[null,null,null,null,null,null,null,null,null,null,null,null,null,null,null,"LIMON CAILLOUTEUX MCS-6",null,20000,20000,"-",1000,20000,"-","-","-","-",360,3240,30240,174600,82800,"-","-","-",5760,5040,41400,25200,"-",null,null,"-",360,3240,30240,174600,82800,"-","-","-",5760,5040,41400,25200,"-",23,6000,110,8000,1125,990]
[null,null,null,null,null,null,null,null,null,null,null,null,null,null,null,"LIMON CAILLOUTEUX MCS-7",null,20000,20000,"-",1000,20000,"-","-","-","-",360,3240,30240,174600,82800,"-","-","-",5760,5040,41400,25200,"-",null,null,"-",360,3240,30240,174600,82800,"-","-","-",5760,5040,41400,25200,"-",11.5,1400,55.75,800,570,493]
[null,null,null,null,null,null,null,null,null,null,null,null,null,null,null,"SABLE MCS-1",null,930,910,"-",23,90,"-","-","-","-",0.92,8.25,77,444.6,210.8,"-","-","-",14.67,12.83,105.4,64.17,"-",null,null,"-",0.92,8.25,77,444.6,210.8,"-","-","-",14.67,12.83,105.4,64.17,"-",0.05,6,0.22,3.5,2.1,2]
[null,null,null,null,null,null,null,null,null,null,null,null,null,null,null,"SABLE MCS-2",null,1600,1600,"-",41,160,"-","-","-","-",1.643,14.79,138,796.8,377.9,"-","-","-",26.29,23,188.9,115,"-",null,null,"-",1.643,14.79,138,796.8,377.9,"-","-","-",26.29,23,188.9,115,"-",0.1,12.5,0.45,6.9,4.5,4.4000000000000004]
[null,null,null,null,null,null,null,null,null,null,null,null,null,null,null,"SABLE MCS-3",null,790,770,"-",21,76,"-","-","-","-",0.77300000000000002,6.9459999999999997,65,375.3,178,"-","-","-",12.38,10.83,88.99,54.16,"-",null,null,"-",0.77300000000000002,6.9459999999999997,65,375.3,178,"-","-","-",12.38,10.83,88.99,54.16,"-",4.65E-2,5.55,0.21,3.15,2.0499999999999998,1.9]
[null,null,null,null,null,null,null,null,null,null,null,null,null,null,null,"SABLE MCS-4",null,6300,6200,"-",150,610,"-","-","-","-",6.2,56.1,523.70000000000005,3024,1434,"-","-","-",99.8,87.3,717,436.4,"-",null,null,"-",6.2,56.1,523.70000000000005,3024,1434,"-","-","-",99.8,87.3,717,436.4,"-",0.22500000000000001,28,1.1000000000000001,16.5,9.5,10]
[null,null,null,null,null,null,null,null,null,null,null,null,null,null,null,"SABLE MCS-5",null,9900,9700,"-",240,950,"-","-","-","-",9.75,87.75,819,4729,2243,"-","-","-",156,136.5,1121,682.5,"-",null,null,"-",9.75,87.75,819,4729,2243,"-","-","-",156,136.5,1121,682.5,"-",0.35499999999999998,44.5,1.55,25.5,14.5,14.5]
[null,null,null,null,null,null,null,null,null,null,null,null,null,null,null,"SABLE MCS-6",null,20000,20000,"-",900,3500,"-","-","-","-",36,324,3024,17460,8280,"-","-","-",576,504,4140,2520,"-",null,null,"-",36,{"$f":"AB118","v":324},3024,17460,8280,"-","-","-",576,504,4140,2520,"-",1.5,170,6,90,65,48]
[null,null,null,null,null,null,null,null,null,null,null,null,null,null,null,"SABLE MCS-7",null,22000,20000,"-",540,2200,"-","-","-","-",21.6,194.4,1914,10480,4968,"-","-","-",345.6,302.39999999999998,2484,1512,"-",null,null,{"$f":"Z119","v":"-"},{"$f":"AA119","v":21.6},194.4,1914,10480,4968,"-","-","-",345.6,302.39999999999998,2484,1512,"-",0.71,83,2.8,43,31.5,23.8]
[]
[]
[]
[null,null,null,null,null,null,null,null,null,null,null,null,null,null,"VSN (GRER v04 partie C)","usage",null,"conc. en mg/kg ms"]
[null,null,null,null,null,null,null,null,null,null,null,null,null,null,null,null,null,"Huile minérale \nEC5-35","Huile minérale \nEC10-40","Fraction\nEC 5-8","Fraction\nEC >8-10","Fraction\nEC >10-12","Fraction\nEC >12-16","Fraction\nEC >16-21","Fraction\nEC >21-35","ALI\nEC 5-6","ALI\nEC >6-8","ALI\nEC >8-10","ALI\nEC >10-12","ALI\nEC >12-16","ALI\nEC >16-21","ALI\nEC >21-35","Arom\nEC 6-7","Arom\nEC >7-8","Arom\nEC >8-10","Arom\nEC >10-12","Arom\nEC >12-16","Arom\nEC >16-21","Arom\nEC >21-35",null,null,"ALI\nEC 5-6","ALI\nEC >6-8","ALI\nEC >8-10","ALI\nEC >10-12","ALI\nEC >12-16","ALI\nEC >16-21","ALI\nEC >21-35","Arom\nEC 6-7","Arom\nEC >7-8","Arom\nEC >8-10","Arom\nEC >10-12","Arom\nEC >12-16","Arom\nEC >16-21","Arom\nEC >21-35","Benzène","Toluène","Ethylbenzène","Xylènes (somme)","MTBE","Naphtalène"]
[null,null,null,null,null,null,null,null,null,null,null,null,null,null,null,"I",null,"-","-",6.2,211,884,8459,481309,1000000,"-","-","-","-","-","-","-","-","-","-","-","-","-","-",null,null,{"$f":"Z125","v":"-"},"-","-","-","-","-","-","-","-","-","-","-","-","-",0.2,9.1999999999999993,8,11,1.6,3.8]
[null,null,null,null,null,null,null,null,null,null,null,null,null,null,null,"II",null,"-","-",5.8,169,679,6415,361909,1000000,"-","-","-","-","-","-","-","-","-","-","-","-","-","-",null,null,"-","-","-","-","-","-","-","-","-","-","-","-","-","-",0.2,7.8,6.4,8.9,1.5,2.9]
[null,null,null,null,null,null,null,null,null,null,null,null,null,null,null,"III",null,"-","-",6,149,577,5393,302208,1000000,"-","-","-","-","-","-","-","-","-","-","-","-","-","-",null,null,"-","-","-","-","-","-","-","-","-","-","-","-","-","-",0.2,7.1,6,7.9,1.5,2.5]
[null,null,null,null,null,null,null,null,null,null,null,null,null,null,null,"IV",null,"-","-",6,149,577,5393,302208,1000000,"-","-","-","-","-","-","-","-","-","-","-","-","-","-",null,null,"-","-","-","-","-","-","-","-","-","-","-","-","-","-",0.2,7.1,6,7.9,1.5,2.5]
[null,null,null,null,null,null,null,null,null,null,null,null,null,null,null,"V",null,"-","-",10,601,2792,27541,1000000,1000000,"-","-","-","-","-","-","-","-","-","-","-","-","-","-",null,null,"-","-","-","-","-","-","-","-","-","-","-","-","-","-",0.21,22,23,30,2,12]
[]
[]
[]
[null,null,null,null,null,null,null,null,null,null,null,null,null,null,"VLN (GRER v04 partie C)","usage",null,"conc. en mg/kg ms"]
[null,null,null,null,null,null,null,null,null,null,null,null,null,null,null,null,null,"Huile minérale \nEC5-35","Huile minérale \nEC10-40","Fraction\nEC 5-8","Fraction\nEC >8-10","Fraction\nEC >10-12","Fraction\nEC >12-16","Fraction\nEC >16-21","Fraction\nEC >21-35","ALI\nEC 5-6","ALI\nEC >6-8","ALI\nEC >8-10","ALI\nEC >10-12","ALI\nEC >12-16","ALI\nEC >16-21","ALI\nEC >21-35","Arom\nEC 6-7","Arom\nEC >7-8","Arom\nEC >8-10","Arom\nEC >10-12","Arom\nEC >12-16","Arom\nEC >16-21","Arom\nEC >21-35",null,null,"ALI\nEC 5-6","ALI\nEC >6-8","ALI\nEC >8-10","ALI\nEC >10-12","ALI\nEC >12-16","ALI\nEC >16-21","ALI\nEC >21-35","Arom\nEC 6-7","Arom\nEC >7-8","Arom\nEC >8-10","Arom\nEC >10-12","Arom\nEC >12-16","Arom\nEC >16-21","Arom\nEC >21-35","Benzène","Toluène","Ethylbenzène","Xylènes (somme)","MTBE","Naphtalène"]
[null,null,null,null,null,null,null,null,null,null,null,null,null,null,null,"I",null,"-","-",12.4,422,1768,16918,962618,1000000,"-","-","-","-","-","-","-","-","-","-","-","-","-","-",null,null,{"$f":"Z135","v":"-"},"-","-","-","-","-","-","-","-","-","-","-","-","-",1,77,41,48,6.59,26]
[null,null,null,null,null,null,null,null,null,null,null,null,null,null,null,"II",null,"-","-",11.6,338,1358,12830,723818,1000000,"-","-","-","-","-","-","-","-","-","-","-","-","-","-",null,null,"-","-","-","-","-","-","-","-","-","-","-","-","-","-",1,65,32,39,6.18,20]
[null,null,null,null,null,null,null,null,null,null,null,null,null,null,null,"III",null,"-","-",12,298,1154,10786,604416,1000000,"-","-","-","-","-","-","-","-","-","-","-","-","-","-",null,null,"-","-","-","-","-","-","-","-","-","-","-","-","-","-",1,59,30,34,6.18,17]
[null,null,null,null,null,null,null,null,null,null,null,null,null,null,null,"IV",null,"-","-",12,298,1154,10786,604416,1000000,"-","-","-","-","-","-","-","-","-","-","-","-","-","-",null,null,"-","-","-","-","-","-","-","-","-","-","-","-","-","-",1,59,30,34,6.18,17]
[null,null,null,null,null,null,null,null,null,null,null,null,null,null,null,"V",null,"-","-",20,1202,5584,55082,1000000,1000000,"-","-","-","-","-","-","-","-","-","-","-","-","-","-",null,null,"-","-","-","-","-","-","-","-","-","-","-","-","-","-",1,184,117,131,8.23,82]

{"sheet":"Sol Wal DS TV","index":5,"n_rows":45,"n_cols":82,"rows_kept":45,"cut":false,"hidden":false,"merged":[[8,71,8,81],[4,46,4,54],[4,17,4,45],[4,71,4,81],[19,71,19,81],[5,46,5,54],[5,71,5,80],[5,17,5,18],[5,39,5,45],[19,46,19,54],[8,46,8,54],[8,55,8,70],[5,19,5,24],[5,25,5,38],[4,1,5,9],[4,10,5,14],[4,15,5,15],[8,1,8,16],[19,1,19,16],[4,16,5,16],[7,10,7,14],[7,8,7,9],[7,15,7,16],[22,46,22,54],[19,55,19,70],[22,55,22,70],[22,1,22,16],[22,71,22,81],[1,1,1,45],[2,2,2,45],[3,19,3,45],[3,2,3,5],[3,6,3,8],[3,10,3,14],[3,17,3,18]]}
[]
[null,"Perceptions de chantier et comparaison des résultats d'analyse (DS) pour la partie fixe du sol "]
[null,"Projet:",{"$f":"'Manuel d''utilisation'!C3","v":"BOF_SL_6000: Rue de la Station, 666 à 4308 Manage"}]
[null,"Type usage DS ",{"$f":"K8","v":"I"},null,null,null,"MO(%):",null,null,{"$f":"'Manuel d''utilisation'!C10","v":3},null,null,null,null,null,"<2µm (%):",{"$f":"'Manuel d''utilisation'!C11","v":7},null,null,{"$f":"'Manuel d''utilisation'!AU11","v":0}]
[null,"Identification du forage",null,null,null,null,null,null,null,null,"Caractéristiques organoleptiques",null,null,null,null,"Echantillon","MS","Résultats d'analyse en mg/kg ms",null,null,null,null,null,null,null,null,null,null,null,null,null,null,null,null,null,null,null,null,null,null,null,null,null,null,null,null,{"$f":"R5","v":"Résultats d'analyse en mg/kg ms"},null,null,null,null,null,null,null,null,{"$f":"AU5","v":"Résultats d'analyse en mg/kg ms"},null,null,null,null,null,null,null,null,null,null,null,null,null,null,null,{"$f":"BD5","v":"Résultats d'analyse en mg/kg ms"}]
[null,null,null,null,null,null,null,null,null,null,null,null,null,null,null,null,null,"HM\nsomme",null,"Hydrocarbures pétroliers\n(fractions globales/combinées)",null,null,null,null,null,"Hydrocarbures pétroliers\n(analyse 'split' aliphatique/aromatique)",null,null,null,null,null,null,null,null,null,null,null,null,null,"Hydrocarbures aromatiques non halogénés",null,null,null,null,null,null,"Métaux/métalloïdes",null,null,null,null,null,null,null,null,null,null,null,null,null,null,"Hydrocarbures aromatiques polycycliques non halogénés",null,null,null,null,null,null,null,null,null,"Hydrocarbures chlorés",null,null,null,null,null,null,null,null,null,"Autres"]
[null,"Parcelle cadastrale","Code du forage","X (Lambert)","Y (Lambert)","Refus de forage(4)","Date du forage","Phase d'étude(4)","Terrain naturel (TN) / Remblai (R)(4)","Profondeur du forage \n(cm-ns)","Profondeur: de (cm-ns) à (cm-ns)","Caractérisation(1) (4)","Odeur/PID(2)","Couleur suspecte(4)","Test huile/eau(2)","Profondeur \nde l'échantillon (cm-ns)","Matière sèche (%)","Huile minérale \nEC 5-35","Huile minérale \nEC 10-40","Fraction\nEC 5-8","Fraction\nEC 8-10","Fraction\nEC 10-12","Fraction\nEC 12-16","Fraction\nEC 16-21","Fraction\nEC 21-35","Ali\nEC 5-6","Ali\nEC 6-8","Ali\nEC 8-10","Ali\nEC 10-12","Ali\nEC 12-16","Ali\nEC 16-21","Ali\nEC 21-35","Aro\nEC 6-7","Aro\nEC 7-8","Aro\nEC 8-10","Aro\nEC 10-12","Aro\nEC 12-16","Aro\nEC 16-21","Aro\nEC 21-35","Benzène","Toluène","Ethylbenzène","Xylènes (somme)","MTBE","Styrènes","Phénol","Arsenic","Cadmium","Chrome total","Chrome VI","Cuivre","Mercure","Nickel","Plomb","Zinc","Naphtalène","Acénaphtylène","Acénaphtène","Fluorène","Phénanthrène","Anthracène","Fluoranthène","Pyrène","Benzo(a)anthracène","Chrysène","Benzo(b)fluoranthène","Benzo(k)fluoranthène","Benzo(a)pyrène","Dibenzo(ah)anthracène","Benzo(ghi)pérylène","Indéno(1,2,3-cd)pyrène","Dichlorométhane","Trichlorométhane","Tetrachlorométhane","Tetrachloroéthène \n(PCE)","Trichloroéthène\n(TCE)","1,2-Dichloroéthène \nsomme (DCE)","Chloroéthène \n(VC)","1,1,1-Trichloroéthane \n(1,1,1-TCA)","1,1,2-Trichloroéthane \n(1,1,2-TCA)","1,2-Dichloroéthane\n(1,2-DCA)","Cyanures libres"]
[null,"NORMES: Concentrations en gras et rouge si dépassement de la norme",null,null,null,null,null,null,"usage DS(4)",null,"I",null,null,null,null,"VS(3)",null,{"$f":"INDEX(R$33:R$37,MATCH($K$8,$P$33:$P$37,0))","v":"-"},"-",6,21,75,75,650,650,"-","-","-","-","-","-","-","-","-","-","-","-","-","-",0.1,4,0.3,1,1.5,0.4,0.3,30,1.8,57,{"$f":"INDEX(AX$33:AX$37,MATCH($K$8,$P$33:$P$37,0))","v":4},53,1.1000000000000001,87,120,196,2.5,4.8,2,5.9,7.6,2.8,6,6.7,9.5,1.1000000000000001,1.7,1,0.87,0.81,0.8,4.5,0.1,0.1,0.05,0.2,0.05,0.1,0.1,1,0.1,0.1,2]
[null,"Zone suspecte investiguée:",null,null,null,null,null,null,null,null,null,null,null,null,null,null,null,null,null,null,null,null,null,null,null,null,null,null,null,null,null,null,null,null,null,null,null,null,null,null,null,null,null,null,null,null,{"$f":"B9","v":"Zone suspecte investiguée:"},null,null,null,null,null,null,null,null,{"$f":"AU9","v":"Zone suspecte investiguée:"},null,null,null,null,null,null,null,null,null,null,null,null,null,null,null,{"$f":"BT20","v":"Autre zone suspecte:"}]
[null,"1076Z","C1",null,null,null,"28/12/2004",null,null,420,"150-200","HA","*","oui",null,"370-400",null,"<38","<38",5,22,5,76,600,5,null,null,null,null,null,null,null,null,null,null,null,null,null,null,0.2]
[]
[]
[]
[]
[]
[]
[]
[]
[]
[null,"Autre zone suspecte:",null,null,null,null,null,null,null,null,null,null,null,null,null,null,null,null,null,null,null,null,null,null,null,null,null,null,null,null,null,null,null,null,null,null,null,null,null,null,null,null,null,null,null,null,{"$f":"B20","v":"Autre zone suspecte:"},null,null,null,null,null,null,null,null,{"$f":"AU20","v":"Autre zone suspecte:"},null,null,null,null,null,null,null,null,null,null,null,null,null,null,null,{"$f":"BD20","v":"Autre zone suspecte:"}]
[]
[]
[null,"Autre zone suspecte:",null,null,null,null,null,null,null,null,null,null,null,null,null,null,null,null,null,null,null,null,null,null,null,null,null,null,null,null,null,null,null,null,null,null,null,null,null,null,null,null,null,null,null,null,{"$f":"B23","v":"Autre zone suspecte:"},null,null,null,null,null,null,null,null,{"$f":"AU23","v":"Autre zone suspecte:"},null,null,null,null,null,null,null,null,null,null,null,null,null,null,null,{"$f":"BD23","v":"Autre zone suspecte:"}]
[]
[]
[null,"Légende"]
[null,"(1) ESS = essence; DI = diesel; HA = hydrocarbures aromatiques ; MC = mazout de chauffage ; AU = autre"]
[null,"(2) Blanc (vide) = néant ; * = léger ; ** = moyen ; *** = fort ou valeur PID mesurée - il n'est pas nécessaire d'indiquer en même temps les perceptions organoleptiques et la réaction huile/eau qui n'est pas strictement nécessaire"]
[null,"(3) A adapter conformément à la législation et aux paramètres spécifiques au site"]
[null,"(4) Liste déroulante"]
[null,null,null,null,null,null,null,null,null,null,null,null,null,null,"VS (DS)","usage",null,"conc. en mg/kg ms"]
[null,null,null,null,null,null,null,null,null,null,null,null,null,null,null,null,null,"Huile minérale \nEC5-35","Huile minérale \nEC10-40","Fraction\nEC 5-8","Fraction\nEC >8-10","Fraction\nEC >10-12","Fraction\nEC >12-16","Fraction\nEC >16-21","Fraction\nEC >21-35","ALI\nEC 5-6","ALI\nEC >6-8","ALI\nEC >8-10","ALI\nEC >10-12","ALI\nEC >12-16","ALI\nEC >16-21","ALI\nEC >21-35","Arom\nEC 6-7","Arom\nEC >7-8","Arom\nEC >8-10","Arom\nEC >10-12","Arom\nEC >12-16","Arom\nEC >16-21","Arom\nEC >21-35","Benzène","Toluène","Ethylbenzène","Xylènes (somme)","MTBE","Styrene","Phénol","Arsenic","Cadmium","Chrome total","Chrome VI","Cuivre","Mercure","Nickel","Plomb","Zinc","Naphtalène","Acénapthylène","Acénapthène","Fluorène","Phénanthrène","Anthracène","Fluoranthène","Pyrène","Benzo(a)anthracène","Chrysène","Benzo(b)fluoranthène","Benzo(k)fluoranthène","Benzo(a)pyrène","Dibenzo(ah)anthracène","Benzo(ghi)pérylène","Indéno(1,2,3-cd)pyrène","Dichlorométhane","trichlorométhane","tetrachlorométhane","tetrachloroéthène \n(PCE)","trichloroéthène\n (TCE)","1,2-Dichloroéthène \nsomme (DCE)","Chloroéthène \n(VC)","1,1,1-trichloroéthane \n(1,1,1-TCA)","1,1,2-trichloroéthane \n(1,1,2-TCA)","1,2-Dichloroéthane\n(1,2-DCA)","Cyanures libres"]
[null,null,null,null,null,null,null,null,null,null,null,null,null,null,null,"I",null,"-","-",6,21,75,75,650,650,"-","-","-","-","-","-","-","-","-","-","-","-","-","-",0.1,4,0.3,1,1.5,0.4,0.3,30,1.8,57,4,53,1.1000000000000001,87,120,196,2.5,4.8,2,5.9,7.6,2.8,6,6.7,9.5,1.1000000000000001,1.7,1,0.87,0.81,0.8,4.5,0.1,0.1,0.05,0.2,0.05,0.1,0.1,1,0.1,0.1,2]
[null,null,null,null,null,null,null,null,null,null,null,null,null,null,null,"II",null,"-","-",6,21,75,75,650,650,"-","-","-","-","-","-","-","-","-","-","-","-","-","-",0.1,4,0.3,1,1.5,0.4,0.3,30,1.8,57,4,53,1.1000000000000001,87,200,196,2.5,4.8,2,5.9,7.6,2.8,6,6.7,9.5,1.1000000000000001,1.7,1,0.87,0.81,0.8,4.5,0.1,0.1,0.05,0.2,0.05,0.1,0.1,1,0.1,0.1,2]
[null,null,null,null,null,null,null,null,null,null,null,null,null,null,null,"III",null,"-","-",6,21,75,75,650,650,"-","-","-","-","-","-","-","-","-","-","-","-","-","-",0.1,7,0.3,2,1.5,0.4,0.7,40,3,78,4,156,1.75,146,200,415,2.5,6.3,4,9,13,2.8,11.6,13,9.5,2.2999999999999998,3.3,2,3.6,1.8,1.5,7,0.1,0.1,0.05,0.2,0.05,0.1,0.1,3.5,0.1,0.1,2]
[null,null,null,null,null,null,null,null,null,null,null,null,null,null,null,"IV",null,"-","-",6,150,580,750,1250,2100,"-","-","-","-","-","-","-","-","-","-","-","-","-","-",0.2,7,3,8,1.5,0.4,0.7,40,10,140,13,490,5,350,390,3000,2.5,8,4,9,13,2.8,23,15.4,9.5,9.6999999999999993,11,5.3,9.5,1.8,6.8,7,0.1,0.1,0.1,0.7,0.7,0.4,0.1,5.5,0.1,0.2,2]
[null,null,null,null,null,null,null,null,null,null,null,null,null,null,null,"V",null,"-","-",9,600,600,920,2700,5300,"-","-","-","-","-","-","-","-","-","-","-","-","-","-",0.2,22,3,30,2,2,1.4,65,20,288,13,600,5,350,1840,3000,6.3,43,6,16,25,6.9,47,28.6,17.3,17.600000000000001,21,9.3000000000000007,14.4,3.2,11.1,12,0.2,0.1,0.1,1.2,0.7,0.5,0.1,15,0.2,0.3,2]
[]
[null,null,null,null,null,null,null,"EO","TN",null,null,"Ess",null,"oui"]
[null,null,null,null,null,"Oui",null,"EC","R",null,null,"DI",null,"non"]
[null,null,null,null,null,null,null,"PA","non défini",null,null,"HA"]
[null,null,null,null,null,null,null,"EF",null,null,null,"MC"]
[null,null,null,null,null,null,null,"MON",null,null,null,"AU"]
[null,null,null,null,null,null,null,"EI"]
[null,null,null,null,null,null,null,"autre/non défini"]

{"sheet":"Sol Wal RGPT","index":6,"n_rows":76,"n_cols":73,"rows_kept":76,"cut":false,"hidden":false,"merged":[[4,16,4,22],[1,1,1,72],[3,1,3,3],[3,4,3,8],[3,9,3,14],[3,16,3,20],[3,21,3,22],[2,2,2,72],[4,10,4,14],[4,46,4,52],[32,16,32,22],[8,14,8,15],[6,8,6,10],[7,8,7,10],[6,11,6,13],[7,11,7,13],[6,14,6,15],[7,14,7,15],[29,1,29,22],[9,1,9,15],[20,1,20,15],[23,1,23,15],[4,1,4,9],[4,44,4,45]]}
[]
[null,"Perceptions de chantier et comparaison des résultats d'analyse (RGPT) pour la partie fixe du sol "]
[null,"Projet:",{"$f":"'Manuel d''utilisation'!C3","v":"BOF_SL_6000: Rue de la Station, 666 à 4308 Manage"}]
[null,"Type d'usage RGPT",null,null,{"$f":"L7","v":"III"},null,null,null,null,"Teneur en matière organique (%) (4) (5)",null,null,null,null,null,{"$f":"+'Manuel d''utilisation'!C10","v":3},"Teneur en argile (%)",null,null,null,null,{"$f":"+'Manuel d''utilisation'!C11","v":7}]
[null,"Identification du forage",null,null,null,null,null,null,null,null,"Caractéristiques organoleptiques",null,null,null,null,"Echantillon","Résultats d'analyse en mg/kg ms",null,null,null,null,null,null,null,null,null,null,null,null,null,null,null,null,null,null,null,null,null,null,null,null,null,null,null,"Facteur correctif",null,"Résultats d'analyse en mg/kg ms après réévaluation sur base du facteur correctif (gravier)"]
[null,"Parcelle cadastrale","Code du forage","X (Lambert)","Y (Lambert)","Refus de forage(6)","Date du forage","Phase d'étude(6)","Terrain naturel (TN) / Remblai (R)(6)","Profondeur du forage \n(cm-mv)","Profondeur: de (cm-ns) à (cm-ns)","Caractérisation(1) (6)","Odeur/PID(2)","Test huile/eau(2)","Couleur suspecte(6)","Profondeur \nde l'échantillon (cm-ns)","Huile minérale \nEC 5-35","Huile minérale\nEC 10-40","Benzène","Toluène","Ethylbenzène","Xylènes","Naphtalène","Cadmium","Chrome","Cuivre","Arsenic","Cobalt","Nickel","Plomb","Zinc","Mercure",null,"Napthalène","Anthracène","Phénantrène ","Fluoranthène","Benzo(a)anthracène","Benzo(k)fluoranthène","Benzo(ghi)pérylène","Indéno(1,2,3-cd)pyrène","Chrysène ","Benzo(a)pyrène",null,"Pourcentage de cailloux","Pourcentage de fractions fines","Huile minérale \nEC 5-35","Huile minérale\nEC 10-40","Benzène","Toluène","Ethylbenzène","Xylènes","Naphtalène","Cadmium","Chrome","Cuivre","Arsenic","Cobalt","Nickel","Plomb","Zinc","Mercure",null,"Naphtalène","Anthracène","Phénantrène ","Fluoranthène","Benzo(a)anthracène","Benzo(k)fluoranthène","Benzo(ghi)pérylène","Indéno(1,2,3-cd)pyrène","Chrysène ","Benzo(a)pyrène"]
[null,"NORMES: Concentrations en gras et rouge si > à VI",null,null,null,null,null,null,"usage (RGPT)(6)",null,null,"III",null,null,"VI (RGPT)(3)",null,null,{"$f":"INDEX(R$73:R$76,MATCH($L$7,$P$73:$P$76,0))","v":900},0.3,30,16.8,4.8,1.44,4,340,100,120,100,220,140,420,20,null,{"$f":"INDEX(AH$73:AH$76,MATCH($L$7,$P$73:$P$76,0))","v":1.44},0.72,19.2,19.2,5.3999999999999995,3.5999999999999996,3.5999999999999996,3.5999999999999996,1.2,1.2,null,null,null,{"$f":"IF($P$4<=2.5,0.5*AU$29,(IF($P$4<=12.5,$P$4/5*AU$29,2.5*AU$29)))","v":0},{"$f":"R7","v":900},0.3,30,16.8,4.8,1.44,{"$f":"X7","v":4},340,100,120,100,220,140,420,20,0,1.44,0.72,19.2,19.2,5.3999999999999995,3.5999999999999996,3.5999999999999996,3.5999999999999996,1.2,1.2]
[null,"NORMES: Concentrations en souligné si > à VS",null,null,null,null,null,null,"usage (RGPT)(6)",null,null,{"$f":"L7","v":"III"},null,null,"VS (RGPT)(3)",null,null,{"$f":"INDEX(R$58:R$61,MATCH($L$8,$P$58:$P$61,0))","v":480},0.15,15,8.4,2.4,0.72,2,170,50,60,50,120,70,210,10,null,{"$f":"INDEX(AH$58:AH$61,MATCH($L$8,$P$58:$P$61,0))","v":0.72},0.36,9.6,9.6,2.6999999999999997,1.7999999999999998,1.7999999999999998,1.7999999999999998,0.6,0.6,null,null,null,{"$f":"IF($P$4<=2.5,0.5*AU$28,(IF($P$4<=12.5,$P$4/5*AU$28,2.5*AU$28)))","v":0},480,0.15,15,8.4,2.4,0.72,2,170,50,60,50,120,70,210,10,0,0.72,0.36,9.6,9.6,2.6999999999999997,1.7999999999999998,1.7999999999999998,1.7999999999999998,0.6,0.6]
[null,"NORMES:Concentrations en italique si > à VR",null,null,null,null,null,null,null,null,null,null,null,null,"VR (RGPT)(3)",null,null,{"$f":"R46","v":50},0.1,0.2,0.3,0.35,0.3,0.8,35,17,19,10,9,30,62,0.55000000000000004,null,{"$f":"AH46","v":0.3},0.05,1,1,0.5,0.3,0.3,0.3,0.1,0.1,null,null,null,null,50,0.1,0.2,0.3,0.35,0.3,0.8,35,17,19,10,9,30,62,0.55000000000000004,0,0.3,0.05,1,1,0.5,0.3,0.3,0.3,0.1,0.1]
[null,"Zone suspecte investiguée:"]
[null,"1076Z","C1",null,null,null,"28/12/2004","EC","TN",420,"150-200","Ess","*",null,"non",null,1000,2000,0.3,2,401,401,401,0.5,null,null,null,null,1,null,null,null,null,null,null,null,null,null,null,null,null,null,null,null,null,1,{"$f":"IFERROR(Q11*$AT11,\"<\")","v":1000},2000,0.3,2,401,401,401,0.5,{"$f":"IFERROR(Y11*$AT11,\"<\")","v":0},0,0,0,1,0,0,0,null,0,{"$f":"IFERROR(AI11*$AT11,\"<\")","v":0},{"$f":"IFERROR(AJ11*$AT11,\"<\")","v":0},{"$f":"IFERROR(AK11*$AT11,\"<\")","v":0},{"$f":"IFERROR(AL11*$AT11,\"<\")","v":0},{"$f":"IFERROR(AM11*$AT11,\"<\")","v":0},{"$f":"IFERROR(AN11*$AT11,\"<\")","v":0},{"$f":"IFERROR(AO11*$AT11,\"<\")","v":0},{"$f":"IFERROR(AP11*$AT11,\"<\")","v":0},{"$f":"IFERROR(AQ11*$AT11,\"<\")","v":0}]
[null,null,null,null,null,null,null,null,null,null,null,null,null,null,null,null,null,null,null,null,null,null,null,null,null,null,null,null,null,null,null,null,null,null,null,null,null,null,null,null,null,null,null,null,null,null,{"$f":"IFERROR(Q12*$AT12,\"<\")","v":0},{"$f":"IFERROR(R12*$AT12,\"<\")","v":0},{"$f":"IFERROR(S12*$AT12,\"<\")","v":0},{"$f":"IFERROR(T12*$AT12,\"<\")","v":0},{"$f":"IFERROR(U12*$AT12,\"<\")","v":0},{"$f":"IFERROR(V12*$AT12,\"<\")","v":0},{"$f":"IFERROR(W12*$AT12,\"<\")","v":0},{"$f":"IFERROR(X12*$AT12,\"<\")","v":0},0,0,0,0,0,0,0,0,null,0,0,0,0,0,0,0,0,0,0]
[null,null,null,null,null,null,null,null,null,null,null,null,null,null,null,null,null,null,null,null,null,null,null,null,null,null,null,null,null,null,null,null,null,null,null,null,null,null,null,null,null,null,null,null,null,null,0,0,0,0,0,0,0,null,0,0,0,0,0,0,0,0,null,0,0,0,0,0,0,0,0,0,0]
[null,null,null,null,null,null,null,null,null,null,null,null,null,null,null,null,null,null,null,null,null,null,null,null,null,null,null,null,null,null,null,null,null,null,null,null,null,null,null,null,null,null,null,null,null,null,0,0,0,0,0,0,0,null,0,0,0,0,0,0,0,0,null,0,0,0,0,0,0,0,0,0,0]
[null,null,null,null,null,null,null,null,null,null,null,null,null,null,null,null,null,null,null,null,null,null,null,null,null,null,null,null,null,null,null,null,null,null,null,null,null,null,null,null,null,null,null,null,null,null,0,0,0,0,0,0,0,null,0,0,0,0,0,0,0,0,null,0,0,0,0,0,0,0,0,0,0]
[null,null,null,null,null,null,null,null,null,null,null,null,null,null,null,null,null,null,null,null,null,null,null,null,null,null,null,null,null,null,null,null,null,null,null,null,null,null,null,null,null,null,null,null,null,null,0,0,0,0,0,0,0,0,0,0,0,0,0,0,0,0,null,0,0,0,0,0,0,0,0,0,0]
[null,null,null,null,null,null,null,null,null,null,null,null,null,null,null,null,null,null,null,null,null,null,null,null,null,null,null,null,null,null,null,null,null,null,null,null,null,null,null,null,null,null,null,null,null,null,0,0,0,0,0,0,0,0,0,0,0,0,0,0,0,0,null,0,0,0,0,0,0,0,0,0,0]
[null,null,null,null,null,null,null,null,null,null,null,null,null,null,null,null,null,null,null,null,null,null,null,null,null,null,null,null,null,null,null,null,null,null,null,null,null,null,null,null,null,null,null,null,null,null,0,0,0,0,0,0,0,0,0,0,0,0,0,0,0,0,null,0,0,0,0,0,0,0,0,0,0]
[null,null,null,null,null,null,null,null,null,null,null,null,null,null,null,null,null,null,null,null,null,null,null,null,null,null,null,null,null,null,null,null,null,null,null,null,null,null,null,null,null,null,null,null,null,null,0,0,0,0,0,0,0,0,0,0,0,0,0,0,0,0,null,0,0,0,0,0,0,0,0,0,0]
[null,null,null,null,null,null,null,null,null,null,null,null,null,null,null,null,null,null,null,null,null,null,null,null,null,null,null,null,null,null,null,null,null,null,null,null,null,null,null,null,null,null,null,null,null,null,0,0,0,0,0,0,0,0,0,0,0,0,0,0,0,0,null,0,0,0,0,0,0,0,0,0,0]
[null,"Autre zone suspecte:"]
[null,"1076V","F201",null,null,null,"2012-05-03",null,null,450,"230-400","Ess","**",null,null,"370-400",401,751,0.11,2,401,401,401,null,null,null,null,null,null,null,null,null,null,null,null,null,null,null,null,null,null,null,null,null,null,0.5,{"$f":"IFERROR(Q22*$AT22,\"<\")","v":200.5},375.5,5.5E-2,1,200.5,200.5,200.5,0,null,null,null,null,null,null,null,null,null,0,{"$f":"IFERROR(AI22*$AT22,\"<\")","v":0},0,0,0,0,0,0,0,0]
[null,null,null,null,null,null,null,null,null,null,null,null,null,null,null,null,null,null,null,null,null,null,null,null,null,null,null,null,null,null,null,null,null,null,null,null,null,null,null,null,null,null,null,null,null,null,0,0,0,0,0,0,0,0,null,null,null,null,null,null,null,null,null,0,0,0,0,0,0,0,0,0,0]
[null,"Autre zone suspecte:"]
[null,null,null,null,null,null,null,null,null,null,null,null,null,null,null,null,null,null,null,null,null,null,null,null,null,null,null,null,null,null,null,null,null,null,null,null,null,null,null,null,null,null,null,null,null,null,{"$f":"R25*$AT$26","v":0},null,{"$f":"S25*$AT$26","v":0},0,0,0,0,{"$f":"IFERROR(X25*$AT25,\"<\")","v":0},null,null,null,null,null,null,null,null,null,{"$f":"IFERROR(AH25*$AT25,\"<\")","v":0},{"$f":"IFERROR(AI25*$AT25,\"<\")","v":0},{"$f":"IFERROR(AJ25*$AT25,\"<\")","v":0},{"$f":"IFERROR(AK25*$AT25,\"<\")","v":0},{"$f":"IFERROR(AL25*$AT25,\"<\")","v":0},{"$f":"IFERROR(AM25*$AT25,\"<\")","v":0},{"$f":"IFERROR(AN25*$AT25,\"<\")","v":0},{"$f":"IFERROR(AO25*$AT25,\"<\")","v":0},{"$f":"IFERROR(AP25*$AT25,\"<\")","v":0},{"$f":"IFERROR(AQ25*$AT25,\"<\")","v":0}]
[null,null,null,null,null,null,null,null,null,null,null,null,null,null,null,null,null,null,null,null,null,null,null,null,null,null,null,null,null,null,null,null,null,null,null,null,null,null,null,null,null,null,null,null,null,null,{"$f":"R26*$AT$26","v":0},null,0,0,0,0,0,0,null,null,null,null,null,null,null,null,null,0,0,0,0,0,0,0,0,0,0]
[null,"Légende"]
[]
[null,"(1) ESS = essence; DI = diesel; HA = hydrocarbures aromatiques ; MC = mazout de chauffage ; AU = autre"]
[null,"(2) Blanc (vide) = néant ; * = léger ; ** = moyen ; *** = fort ou valeur PID mesurée - il n'est pas nécessaire d'indiquer en même temps les perceptions organoleptiques et la réaction huile/eau qui n'est pas strictement nécessaire"]
[null,"(3) A adapter conformément à la législation et aux paramètres spécifiques au site"]
[null,"(4) Une teneur en matière organique non représentative (analyse réalisée sur un échantillon pollué) ne sera pas prise en compte dans le calcul de la moyenne"]
[null,"(5) La norme (VS ou VI) sera automatiquement recalculée sur base de la MO (pour une MO comprise entre 2,5 et 12,5%)"]
[null,"(6) Liste déroulante"]
[]
[null,null,null,null,null,null,null,"EO","TN",null,null,"Ess",null,null,"oui"]
[null,null,null,null,null,"Oui",null,"EC","R",null,null,"DI",null,null,"non"]
[null,null,null,null,null,null,null,"PA","non défini",null,null,"HA"]
[null,null,null,null,null,null,null,"EF",null,null,null,"MC"]
[null,null,null,null,null,null,null,"MON",null,null,null,"AU"]
[null,null,null,null,null,null,null,"EI"]
[null,null,null,null,null,null,null,"autre/non défini"]
[]
[null,null,null,null,null,null,null,null,null,null,null,null,null,"VR (RGPT)",null,"affectation"]
[null,null,null,null,null,null,null,null,null,null,null,null,null,null,null,null,null,"Huile minérale\nEC10-40","Benzène","Toluène","Ethylbenzène","Xylènes","Naphtalène","Cd","Cr","Cu","As","Co","Ni","Pb","Zn","Hg",null,"HAP Classe I\nnapthalène","HAP Classe II\nAnthracène","HAP Classe III\nPhénantrène ","HAP Classe III\nFluoranthène","HAP Classe IV\nbenzo(a)anthracène","HAP Classe V\nbenzo(k)fluoranthène","HAP Classe V\nBenzo(gho)pérylène","HAP Classe V\n Indéno(1,2,3-cd)pyrène","HAP Classe VI\nChrysène ","HAP Classe VI\nBenzo(a)pyrène"]
[null,null,null,null,null,null,null,null,null,null,null,null,null,null,null,"I-IV",null,50,0.1,0.2,0.3,0.35,0.3,0.8,35,17,19,10,9,30,62,0.55000000000000004,null,0.3,0.05,1,1,0.5,0.3,0.3,0.3,0.1,0.1]
[]
[]
[]
[null,null,null,null,null,null,null,null,null,null,null,null,null,"VS (RGPT)",null,"affectation"]
[null,null,null,null,null,null,null,null,null,null,null,null,null,null,null,null,null,"Huile minérale\nEC10-40","Benzène","Toluène","Ethylbenzène","Xylènes","Naphtalène","Cd","Cr","Cu","As","Co","Ni","Pb","Zn","Hg",null,"HAP Classe I\nnapthalène","HAP Classe II\nAnthracène","HAP Classe III\nPhénantrène ","HAP Classe III\nFluoranthène","HAP Classe IV\nbenzo(a)anthracène","HAP Classe V\nbenzo(k)fluoranthène","HAP Classe V\nBenzo(gho)pérylène","HAP Classe V\n Indéno(1,2,3-cd)pyrène","HAP Classe VI\nChrysène ","HAP Classe VI\nBenzo(a)pyrène"]
[null,null,null,null,null,null,null,null,null,null,null,null,null,null,null,"I",null,1000,1.5,100,45,55,90,8,230,210,100,100,150,1150,680,15,null,90,18,65,65,125,18,18,18,1,1]
[null,null,null,null,null,null,null,null,null,null,null,null,null,null,null,"II",null,800,0.25,25,18,30,2.5,3,150,200,55,50,150,150,500,7,null,2.5,18,30,30,125,18,18,18,1,1]
[null,null,null,null,null,null,null,null,null,null,null,null,null,null,null,"III",null,800,0.25,25,14,4,1.2,2,170,50,60,50,120,70,210,10,null,1.2,0.6,16,16,4.5,3,3,3,1,1]
[null,null,null,null,null,null,null,null,null,null,null,null,null,null,null,"IV",null,500,0.2,0.4,0.6,0.7,0.6,1,65,50,22,20,40,70,150,1.6,null,0.6,0.15,2,2,1.2,2.4,2.4,2.4,1,1]
[]
[null,null,null,null,null,null,null,null,null,null,null,null,null,null,null,"apres correction mat. org.",null,null,null,"%MO:",{"$f":"$P$4","v":3}]
[null,null,null,null,null,null,null,null,null,null,null,null,null,null,null,"I",null,{"$f":"IF($P$4<=2.5,0.5*R52,(IF($P$4<=12.5,$P$4/5*R52,2.5*R52)))","v":600},0.89999999999999991,60,27,33,54,{"$f":"X52","v":8},{"$f":"Y52","v":230},210,100,100,150,1150,680,15,null,{"$f":"IF($P$4<=2.5,0.5*AH52,(IF($P$4<=12.5,$P$4/5*AH52,2.5*AH52)))","v":54},10.799999999999999,39,39,75,10.799999999999999,10.799999999999999,10.799999999999999,0.6,0.6]
[null,null,null,null,null,null,null,null,null,null,null,null,null,null,null,"II",null,{"$f":"IF($P$4<=2.5,0.5*R53,(IF($P$4<=12.5,$P$4/5*R53,2.5*R53)))","v":480},0.15,15,10.799999999999999,18,1.5,{"$f":"X53","v":3},150,200,55,50,150,150,500,7,null,{"$f":"IF($P$4<=2.5,0.5*AH53,(IF($P$4<=12.5,$P$4/5*AH53,2.5*AH53)))","v":1.5},10.799999999999999,18,18,75,10.799999999999999,10.799999999999999,10.799999999999999,0.6,0.6]
[null,null,null,null,null,null,null,null,null,null,null,null,null,null,null,"III",null,480,0.15,15,8.4,2.4,0.72,{"$f":"X54","v":2},170,50,60,50,120,70,210,10,null,{"$f":"IF($P$4<=2.5,0.5*AH54,(IF($P$4<=12.5,$P$4/5*AH54,2.5*AH54)))","v":0.72},0.36,9.6,9.6,2.6999999999999997,1.7999999999999998,1.7999999999999998,1.7999999999999998,0.6,0.6]
[null,null,null,null,null,null,null,null,null,null,null,null,null,null,null,"IV",null,300,0.12,0.24,0.36,0.42,0.36,{"$f":"X55","v":1},65,50,22,20,40,70,150,1.6,null,{"$f":"IF($P$4<=2.5,0.5*AH55,(IF($P$4<=12.5,$P$4/5*AH55,2.5*AH55)))","v":0.36},0.09,1.2,1.2,0.72,1.44,1.44,1.44,0.6,0.6]
[]
[]
[]
[null,null,null,null,null,null,null,null,null,null,null,null,null,"VI (RGPT)",null,"affectation"]
[null,null,null,null,null,null,null,null,null,null,null,null,null,null,null,null,null,"Huile minérale\nEC10-40","Benzène","Toluène","Ethylbenzène","Xylènes","Naphtalène","Cd","Cr","Cu","As","Co","Ni","Pb","Zn","Hg",null,"HAP Classe I\nnapthalène","HAP Classe II\nAnthracène","HAP Classe III\nPhénantrène ","HAP Classe III\nFluoranthène","HAP Classe IV\nbenzo(a)anthracène","HAP Classe V\nbenzo(k)fluoranthène","HAP Classe V\nBenzo(gho)pérylène","HAP Classe V\n Indéno(1,2,3-cd)pyrène","HAP Classe VI\nChrysène ","HAP Classe VI\nBenzo(a)pyrène"]
[null,null,null,null,null,null,null,null,null,null,null,null,null,null,null,"I",null,2000,3,200,90,110,180,16,460,420,200,200,300,2300,1360,30,null,180,36,130,130,250,36,36,36,2,2]
[null,null,null,null,null,null,null,null,null,null,null,null,null,null,null,"II",null,1500,0.5,50,36,60,5,6,300,400,110,100,300,300,1000,15,null,5,36,60,60,250,36,36,36,2,2]
[null,null,null,null,null,null,null,null,null,null,null,null,null,null,null,"III",null,1500,0.5,50,28,8,2.4,4,340,100,120,100,220,140,420,20,null,2.4,1.2,32,32,9,6,6,6,2,2]
[null,null,null,null,null,null,null,null,null,null,null,null,null,null,null,"IV",null,1000,0.4,0.8,1.2,1.4,1.2,2,130,100,45,40,80,140,300,3.1,null,1.2,0.3,4,4,2.4,4.8,4.8,4.8,2,2]
[]
[null,null,null,null,null,null,null,null,null,null,null,null,null,null,null,"apres correction mat. org.",null,null,null,"%MO:",{"$f":"$P$4","v":3}]
[null,null,null,null,null,null,null,null,null,null,null,null,null,null,null,"I",null,{"$f":"IF($P$4<=2.5,0.5*R67,(IF($P$4<=12.5,$P$4/5*R67,2.5*R67)))","v":1200},1.7999999999999998,120,54,66,108,{"$f":"X67","v":16},{"$f":"Y67","v":460},420,200,200,300,2300,1360,30,null,{"$f":"IF($P$4<=2.5,0.5*AH67,(IF($P$4<=12.5,$P$4/5*AH67,2.5*AH67)))","v":108},21.599999999999998,78,78,150,21.599999999999998,21.599999999999998,21.599999999999998,1.2,1.2]
[null,null,null,null,null,null,null,null,null,null,null,null,null,null,null,"II",null,{"$f":"IF($P$4<=2.5,0.5*R68,(IF($P$4<=12.5,$P$4/5*R68,2.5*R68)))","v":900},0.3,30,21.599999999999998,36,3,{"$f":"X68","v":6},300,400,110,100,300,300,1000,15,null,{"$f":"IF($P$4<=2.5,0.5*AH68,(IF($P$4<=12.5,$P$4/5*AH68,2.5*AH68)))","v":3},21.599999999999998,36,36,150,21.599999999999998,21.599999999999998,21.599999999999998,1.2,1.2]
[null,null,null,null,null,null,null,null,null,null,null,null,null,null,null,"III",null,{"$f":"IF($P$4<=2.5,0.5*R69,(IF($P$4<=12.5,$P$4/5*R69,2.5*R69)))","v":900},0.3,30,16.8,4.8,1.44,{"$f":"X69","v":4},340,100,120,100,220,140,420,20,null,{"$f":"IF($P$4<=2.5,0.5*AH69,(IF($P$4<=12.5,$P$4/5*AH69,2.5*AH69)))","v":1.44},0.72,19.2,19.2,5.3999999999999995,3.5999999999999996,3.5999999999999996,3.5999999999999996,1.2,1.2]
[null,null,null,null,null,null,null,null,null,null,null,null,null,null,null,"IV",null,{"$f":"IF($P$4<=2.5,0.5*R70,(IF($P$4<=12.5,$P$4/5*R70,2.5*R70)))","v":600},0.24,0.48,0.72,0.84,0.72,{"$f":"X70","v":2},130,100,45,40,80,140,300,3.1,null,{"$f":"IF($P$4<=2.5,0.5*AH70,(IF($P$4<=12.5,$P$4/5*AH70,2.5*AH70)))","v":0.72},0.18,2.4,2.4,1.44,2.88,2.88,2.88,1.2,1.2]

{"sheet":"Eau Wal DS TE","index":7,"n_rows":95,"n_cols":48,"rows_kept":95,"cut":false,"hidden":false,"merged":[[7,1,7,18],[16,1,16,18],[22,1,22,18],[3,47,5,47],[1,1,1,47],[2,2,2,47],[3,20,3,46],[4,21,4,26],[4,27,4,40],[4,19,4,20],[4,41,4,46],[3,1,4,6],[3,7,4,18]]}
[]
[null,"Perceptions de chantier et comparaison des résultats d'analyse (DS) pour l'eau souterraine"]
[null,"Projet:",{"$f":"'Manuel d''utilisation'!C3","v":"BOF_SL_6000: Rue de la Station, 666 à 4308 Manage"}]
[null,"Identification du piézomètre",null,null,null,null,null,"Mesures de chantier",null,null,null,null,null,null,null,null,null,null,null,null,"Résultats d'analyse en µg/l",null,null,null,null,null,null,null,null,null,null,null,null,null,null,null,null,null,null,null,null,null,null,null,null,null,null,"Remarques (couleur, turbidité, limpidité, …)"]
[null,null,null,null,null,null,null,null,null,null,null,null,null,null,null,null,null,null,null,"HM somme",null,"Hydrocarbures pétroliers\n(fractions globales/combinées)",null,null,null,null,null,"Hydrocarbures pétroliers\n(analyse 'split' aliphatique/aromatique)",null,null,null,null,null,null,null,null,null,null,null,null,null,"BTEXN/MTBE"]
[null,"Parcelle cadastrale","Code du piézomètre","X (Lambert)","Y (Lambert)","Profondeur de l'ouvrage (cm-ns)(5)","Profondeur de la crépine: de (cm-ns) à \n(cm-ns)","Date","Phase d'étude(4)","Niveau d’eau par rapport au sommet du piézomètre (cm-ns)(1)","Quantité prélevée avant échantilllonnage (litre)","Piézomètre bien ou mal alimenté(4)","Zone de captage (I, IIa, IIb)(4)","Nappe exploitable ou non-exploitable(4)","Température (°C)","Ec (µS/cm)","Odeur: type(4)","Odeur: intensité(4)","pH","Huile minérale EC 5-35","Huile minérale EC 10-40","Fraction\nEC 5-8","Fraction\nEC 8-10","Fraction\nEC 10-12","Fraction\nEC 12-16","Fraction\nEC 16-21","Fraction\nEC 21-35","Ali\nEC 5-6","Ali\nEC 6-8","Ali\nEC 8-10","Ali\nEC 10-12","Ali\nEC 12-16","Ali\nEC 16-21","Ali\nEC 21-35","Aro\nEC 6-7","Aro\nEC 7-8","Aro\nEC 8-10","Aro\nEC 10-12","Aro\nEC 12-16","Aro\nEC 16-21","Aro\nEC 21-35","Benzène","Toluène","Ethylbenzène","Xylènes (total)","MTBE","Naphtalène"]
[null,"NORMES:  Concentrations en gras et rouge si dépassement de la norme",null,null,null,null,null,null,null,null,null,null,null,"VSnappe",null,null,null,null,null,null,null,60,200,200,200,300,300,null,null,null,null,null,null,null,null,null,null,null,null,null,null,10,700,300,500,300,60]
[null,"Zone suspecte investiguée: "]
[null,"456e","P1",null,null,450,"200-400","2006-06-07","EO",2.4,6,"bien","IIb","Exploit.",null,null,"DI"," +",6.27,null,null,62,100,null,null,null,null,null,null,null,null,null,null,null,null,null,null,null,null,null,null,20,600,2.5,9,40,-0.05]
[]
[]
[]
[]
[]
[]
[]
[null,"Autre zone suspecte:"]
[]
[]
[]
[]
[]
[null,"Autre zone suspecte:"]
[]
[]
[]
[]
[]
[null,"Légende"]
[null,null,null,null,null,null,null,null,null,null,null,null,null,null,null,null,null,null,"VLnappe",null,null,120,400,400,400,600,600,null,null,null,null,null,null,null,null,null,null,null,null,null,null,40,5850,1520,2175,1235,410]
[null,null,null,null,null,null,null,null,null,null,null,null,null,null,null,null,null,null,"VSnappe/volatisation",null,null,null,null,null,null,null,null,8464,5578,189.7,126.7,29.12,21.76,0.2175,255.4,19770,6294,21360,55060,105900,916000,255.4,19770,517.79999999999995,7245,57510,596.20000000000005]
[]
[null,null,null,null,null,null,null,"typeprofil",null,null,null,"LIMON MCS-1",null,null,null,null,null,null,"eq. eau BOF-SRA (annexe 5) (3)",{"$f":"INDEX(T$61:T$95,MATCH($L$33,$S$61:$S$95,0))","v":6276.6318490000003},{"$f":"INDEX(U$61:U$95,MATCH($L$33,$S$61:$S$95,0))","v":4629.4418490000007},null,null,null,null,null,null,{"$f":"INDEX(AB$61:AB$95,MATCH($L$33,$S$61:$S$95,0))","v":0},35.36,43.83,19.7,0.44040000000000001,1.449E-3,null,null,null,{"$f":"INDEX(AK$61:AK$95,MATCH($L$33,$S$61:$S$95,0))","v":1568},{"$f":"INDEX(AL$61:AL$95,MATCH($L$33,$S$61:$S$95,0))","v":871.7},{"$f":"INDEX(AM$61:AM$95,MATCH($L$33,$S$61:$S$95,0))","v":3361},{"$f":"INDEX(AN$61:AN$95,MATCH($L$33,$S$61:$S$95,0))","v":376.6},null,{"$f":"INDEX(AP$61:AP$95,MATCH($L$33,$S$61:$S$95,0))","v":63.53},4887,124.6,2020,15100,157.80000000000001]
[]
[null,"(1) S'il y a une couche surnageante, il convient d'en mentionner les parties supérieure et inférieure"]
[null,"(3) A adapter conformément à la législation et aux paramètres spécifiques au site"]
[null,"(4) Liste déroulante"]
[null,"(5) Si différente de la profondeur de la base de la crépine"]
[]
[null,null,null,null,null,null,null,null,"EO"]
[null,null,null,null,null,null,null,null,"EC",null,"data validation"]
[null,null,null,null,null,null,null,null,"PA",null,null,"bien","I","Exploit.",null,null,"Ess"," -"]
[null,null,null,null,null,null,null,null,"EF",null,null,"mal","IIa","Non Expl.",null,null,"DI"," +"]
[null,null,null,null,null,null,null,null,"MON",null,null,"insuffisam.","IIb","non défini",null,null,"HA"," ++"]
[null,null,null,null,null,null,null,null,"EI",null,null,"non défini","hors zone",null,null,null,"MC"]
[null,null,null,null,null,null,null,null,"autre/non défini",null,null,null,null,null,null,null,"AU"]
[]
[]
[]
[]
[]
[]
[]
[]
[]
[]
[]
[]
[null,null,null,null,null,null,null,null,null,null,null,null,null,"Dir annexe 5",null,null,null,null,null,"conc. En µg/l"]
[null,null,null,null,null,null,null,null,null,null,null,null,null,null,null,null,null,null,null,"Huile minérale EC5-35","Huile minérale EC10-40","Fraction\nEC 5-8","Fraction\nEC >8-10","Fraction\nEC >10-12","Fraction\nEC >12-16","Fraction\nEC >16-21","Fraction\nEC >21-35","ALI\nEC 5-6","ALI\nEC >6-8","ALI\nEC >8-10","ALI\nEC >10-12","ALI\nEC >12-16","ALI\nEC >16-21","ALI\nEC >21-35","Arom\nEC 6-7","Arom\nEC >7-8","Arom\nEC >8-10","Arom\nEC >10-12","Arom\nEC >12-16","Arom\nEC >16-21","Arom\nEC >21-35","Benzène","Toluène","Ethylbenzène","Xylènes (total)","MTBE","Naphtalène"]
[null,null,null,null,null,null,null,null,null,null,null,null,null,null,null,null,null,null,"LIMON MCS-1",6276.6318490000003,4629.4418490000007,null,null,null,null,null,null,null,35.36,43.83,19.7,0.44040000000000001,1.449E-3,null,null,null,1568,871.7,3361,376.6,null,63.53,4887,124.6,2020,15100,157.80000000000001]
[null,null,null,null,null,null,null,null,null,null,null,null,null,null,null,null,null,null,"LIMON MCS-2",8560.4418490000007,5419.741849,null,null,null,null,null,null,null,67.180000000000007,83.52,19.7,0.44040000000000001,1.449E-3,null,null,null,2990,1662,3361,376.6,null,122,9286,236.8,3838,28690,299.89999999999998]
[null,null,null,null,null,null,null,null,null,null,null,null,null,null,null,null,null,null,"LIMON MCS-3",4702.5918490000004,3544.0418489999997,null,null,null,null,null,null,null,24.75,30.8,19.7,0.44040000000000001,1.449E-3,null,null,null,1103,613.29999999999995,2534,376.6,null,47.06,3601,95.26,1520,11330,118.4]
[null,null,null,null,null,null,null,null,null,null,null,null,null,null,null,null,null,null,"LIMON MCS-4",16305.941849000001,8098.741849,null,null,null,null,null,null,null,175.9,218.3,19.7,0.44040000000000001,1.449E-3,null,null,null,7813,4341,3361,376.6,null,333.3,2572,649.9,10370,75510,841.8]
[null,null,null,null,null,null,null,null,null,null,null,null,null,null,null,null,null,null,"LIMON MCS-5",16227.741849,8072.741849,null,null,null,null,null,null,null,175,217,19.7,0.44040000000000001,1.449E-3,null,null,null,7763,4315,3361,376.6,null,317.7,24310,658.8,10100,70980,776]
[null,null,null,null,null,null,null,null,null,null,null,null,null,null,null,null,null,null,"LIMON MCS-6",59285.941848999995,18247.741848999998,null,null,null,null,null,null,null,3129,249.2,19.7,0.44040000000000001,1.449E-3,null,null,null,37660,14490,3361,376.6,null,5490,303100,11220,96190,1208000,14200]
[null,null,null,null,null,null,null,null,null,null,null,null,null,null,null,null,null,null,"LIMON MCS-7",59285.941848999995,18247.741848999998,null,null,null,null,null,null,null,3129,249.2,19.7,0.44040000000000001,1.449E-3,null,null,null,37660,14490,3361,376.6,null,2745,216100,5698,86450,664500,6839]
[null,null,null,null,null,null,null,null,null,null,null,null,null,null,null,null,null,null,"LIMON SABLEUX MCS-1",4878.9718490000005,3673.5418489999997,null,null,null,null,null,null,null,25.47,31.96,19.7,0.44040000000000001,1.449E-3,null,null,null,1148,637.79999999999995,2639,376.6,null,43.22,3188,81.72,1283,10810,108.8]
[null,null,null,null,null,null,null,null,null,null,null,null,null,null,null,null,null,null,"LIMON SABLEUX MCS-2",6847.5018490000002,4827.741849,null,null,null,null,null,null,null,42.19,53.57,19.7,0.44040000000000001,1.449E-3,null,null,null,1924,1070,3361,376.6,null,122,9286,236.8,3838,28690,299.89999999999998]
[null,null,null,null,null,null,null,null,null,null,null,null,null,null,null,null,null,null,"LIMON SABLEUX MCS-3",2307.7118489999998,1754.761849,null,null,null,null,null,null,null,11.59,14.66,17.62,0.44040000000000001,1.449E-3,null,null,null,526.70000000000005,293,1210,233.7,null,35.659999999999997,259.8,72.73,1116,8700,91.86]
[null,null,null,null,null,null,null,null,null,null,null,null,null,null,null,null,null,null,"LIMON SABLEUX MCS-4",11790.741849,6538.741849,null,null,null,null,null,null,null,109.7,139.30000000000001,19.7,0.44040000000000001,1.449E-3,null,null,null,5003,2781,3361,376.6,null,210.7,16300,433.1,6717,50870,543.9]
[null,null,null,null,null,null,null,null,null,null,null,null,null,null,null,null,null,null,"LIMON SABLEUX MCS-5",12345.741849,6730.741849,null,null,null,null,null,null,null,118.2,148.80000000000001,19.7,0.44040000000000001,1.449E-3,null,null,null,5348,2973,3361,376.6,null,219.7,17120,451.1,7018,50520,549.9]
[null,null,null,null,null,null,null,null,null,null,null,null,null,null,null,null,null,null,"LIMON SABLEUX MCS-6",59022.941848999995,18247.741848999998,null,null,null,null,null,null,null,2866,249.2,19.7,0.44040000000000001,1.449E-3,null,null,null,37660,14490,3361,376.6,null,3206,283400,6538,96190,771800,8219]
[null,null,null,null,null,null,null,null,null,null,null,null,null,null,null,null,null,null,"LIMON SABLEUX MCS-7",59022.941848999995,18247.741848999998,null,null,null,null,null,null,null,2866,249.2,19.7,0.44040000000000001,1.449E-3,null,null,null,37660,14490,3361,376.6,null,1675,129900,3269,48460,407000,3868]
[null,null,null,null,null,null,null,null,null,null,null,null,null,null,null,null,null,null,"ARGILE MCS-1",6979.0918490000004,4869.741849,null,null,null,null,null,null,null,47.02,56.33,19.7,0.44040000000000001,1.449E-3,null,null,null,2006,1112,3361,376.6,null,79.64,5815,159.1,2385,17550,183.3]
[null,null,null,null,null,null,null,null,null,null,null,null,null,null,null,null,null,null,"ARGILE MCS-2",9912.1018490000006,5882.741849,null,null,null,null,null,null,null,89.76,107.6,19.7,0.44040000000000001,1.449E-3,null,null,null,3832,2125,3361,376.6,null,159.30000000000001,11630,318.2,4771,35100,366.7]
[null,null,null,null,null,null,null,null,null,null,null,null,null,null,null,null,null,null,"ARGILE MCS-3",5672.4018489999999,4248.6418490000005,null,null,null,null,null,null,null,31.74,38.020000000000003,19.7,0.44040000000000001,1.449E-3,null,null,null,1354,750.9,3101,376.6,null,55.38,4342,114,1762,12620,134.4]
[null,null,null,null,null,null,null,null,null,null,null,null,null,null,null,null,null,null,"ARGILE MCS-4",20939.541849000001,9708.741849,null,null,null,null,null,null,null,251.6,249.2,19.7,0.44040000000000001,1.449E-3,null,null,null,10730,5951,3361,376.6,null,451.3,35200,944.5,14370,104200,1146]
[null,null,null,null,null,null,null,null,null,null,null,null,null,null,null,null,null,null,"ARGILE MCS-5",19673.641849,9263.741849,null,null,null,null,null,null,null,232.7,249.2,19.7,0.44040000000000001,1.449E-3,null,null,null,9928,5506,3361,376.6,null,400.6,31790,837.9,13010,86660,924.3]
[null,null,null,null,null,null,null,null,null,null,null,null,null,null,null,null,null,null,"ARGILE MCS-6",58080.941848999995,18247.741848999998,null,null,null,null,null,null,null,1924,249.2,19.7,0.44040000000000001,1.449E-3,null,null,null,37660,14490,3361,376.6,null,7602,303100,13520,96190,1810000,16040]
[null,null,null,null,null,null,null,null,null,null,null,null,null,null,null,null,null,null,"ARGILE MCS-7",58080.941848999995,18247.741848999998,null,null,null,null,null,null,null,1924,249.2,19.7,0.44040000000000001,1.449E-3,null,null,null,37660,14490,3361,376.6,null,3644,267500,6395,94870,898400,7486]
[null,null,null,null,null,null,null,null,null,null,null,null,null,null,null,null,null,null,"LIMON CAILLOUTEUX MCS-1",5342.0818490000001,4007.0418489999997,null,null,null,null,null,null,null,29.47,35.57,19.7,0.44040000000000001,1.449E-3,null,null,null,1270,704.3,2906,376.6,null,52.04,3836,105.3,1596,12290,134]
[null,null,null,null,null,null,null,null,null,null,null,null,null,null,null,null,null,null,"LIMON CAILLOUTEUX MCS-2",7617.9318490000005,5090.741849,null,null,null,null,null,null,null,55.84,67.349999999999994,19.7,0.44040000000000001,1.449E-3,null,null,null,2404,1333,3361,376.6,null,87.03,6813,195.1,2793,21950,251.2]
[null,null,null,null,null,null,null,null,null,null,null,null,null,null,null,null,null,null,"LIMON CAILLOUTEUX MCS-3",2441.8918490000001,1854.5718489999999,null,null,null,null,null,null,null,12.97,15.65,18.63,0.44040000000000001,1.449E-3,null,null,null,558.70000000000005,309.89999999999998,1279,246.6,null,38.76,3000,79.59,1197,9246,100.5]
[null,null,null,null,null,null,null,null,null,null,null,null,null,null,null,null,null,null,"LIMON CAILLOUTEUX MCS-4",13514.541848999999,7126.741849,null,null,null,null,null,null,null,141.5,170.3,19.7,0.44040000000000001,1.449E-3,null,null,null,6076,3369,3361,376.6,null,254.8,19750,519.79999999999995,8138,60150,664.3]
[null,null,null,null,null,null,null,null,null,null,null,null,null,null,null,null,null,null,"LIMON CAILLOUTEUX MCS-5",12143.841849,6653.741849,null,null,null,null,null,null,null,121.8,146.30000000000001,19.7,0.44040000000000001,1.449E-3,null,null,null,5222,2896,3361,376.6,null,215.3,16830,448.7,6942,50050,547.1]
[null,null,null,null,null,null,null,null,null,null,null,null,null,null,null,null,null,null,"LIMON CAILLOUTEUX MCS-6",57552.941848999995,18247.741848999998,null,null,null,null,null,null,null,1396,249.2,19.7,0.44040000000000001,1.449E-3,null,null,null,37660,14490,3361,376.6,null,4127,303100,8583,96190,987800,11050]
[null,null,null,null,null,null,null,null,null,null,null,null,null,null,null,null,null,null,"LIMON CAILLOUTEUX MCS-7",57552.941848999995,18247.741848999998,null,null,null,null,null,null,null,1396,249.2,19.7,0.44040000000000001,1.449E-3,null,null,null,37660,14490,3361,376.6,null,2064,160300,4350,63830,500500,5504]
[null,null,null,null,null,null,null,null,null,null,null,null,null,null,null,null,null,null,"SABLE MCS-1",1228.896849,933.59184900000002,null,null,null,null,null,null,null,6.2220000000000004,7.7830000000000004,9.35,0.44040000000000001,1.449E-3,null,null,null,281.3,156,643.70000000000005,124.1,null,16.97,1285,31.91,519.6,4119,41.21]
[null,null,null,null,null,null,null,null,null,null,null,null,null,null,null,null,null,null,"SABLE MCS-2",2202.1618490000001,1673.1018489999999,null,null,null,null,null,null,null,11.11,13.95,16.760000000000002,0.44040000000000001,1.449E-3,null,null,null,504,279.60000000000002,1154,222.3,null,33.93,2677,65.27,1024,8827,90.66]
[null,null,null,null,null,null,null,null,null,null,null,null,null,null,null,null,null,null,"SABLE MCS-3",1037.3138489999999,788.13384900000005,null,null,null,null,null,null,null,5.2279999999999998,6.5519999999999996,7.8920000000000003,0.44040000000000001,1.449E-3,null,null,null,237.4,131.69999999999999,543.4,104.7,null,15.78,1189,30.46,467.6,4021,39.15]
[null,null,null,null,null,null,null,null,null,null,null,null,null,null,null,null,null,null,"SABLE MCS-4",6827.5918490000004,4818.741849,null,null,null,null,null,null,null,41.93,52.92,19.7,0.44040000000000001,1.449E-3,null,null,null,1914,1061,3361,376.6,null,76.349999999999994,5997,159.5,2449,18630,206]
[null,null,null,null,null,null,null,null,null,null,null,null,null,null,null,null,null,null,"SABLE MCS-5",8556.4618489999993,5416.741849,null,null,null,null,null,null,null,65.94,82.78,19.7,0.44040000000000001,1.449E-3,null,null,null,2991,1659,3361,376.6,null,120.5,9531,224.8,3786,28440,298.8]
[null,null,null,null,null,null,null,null,null,null,null,null,null,null,null,null,null,null,"SABLE MCS-6",21427.441848999999,9884.741849,null,null,null,null,null,null,null,243.5,249.2,19.7,0.44040000000000001,1.449E-3,null,null,null,11050,6127,3361,376.6,null,509,36410,870.3,13360,127500,989]
[null,null,null,null,null,null,null,null,null,null,null,null,null,null,null,null,null,null,"SABLE MCS-7",14390.241849,7433.741849,null,null,null,null,null,null,null,146.1,183.4,19.7,0.44040000000000001,1.449E-3,null,null,null,6627,3676,3361,376.6,null,240.9,17780,406.1,6383,61790,490.4]

{"sheet":"AR Eau BOF_TRA & SRA","index":8,"n_rows":95,"n_cols":48,"rows_kept":95,"cut":false,"hidden":false,"merged":[[32,1,32,6],[29,1,29,6],[30,1,30,6],[31,1,31,6],[6,1,6,18],[15,1,15,18],[21,1,21,18],[31,11,31,13],[30,11,30,13],[29,11,29,13],[29,7,29,10],[30,7,30,10],[31,7,31,10],[32,11,32,13],[32,7,32,10],[32,14,32,18],[28,1,28,6],[29,14,29,18],[30,14,30,18],[31,14,31,18],[1,1,1,47],[2,2,2,47],[3,20,3,46],[4,21,4,26],[4,27,4,40],[4,19,4,20],[4,41,4,46],[3,1,4,6],[3,7,4,18],[3,47,5,47]]}
[]
[null,"Perceptions de chantier et comparaison des résultats d'analyse (DS) pour l'eau souterraine"]
[null,"Projet:",{"$f":"'Manuel d''utilisation'!C3","v":"BOF_SL_6000: Rue de la Station, 666 à 4308 Manage"}]
[null,"Identification du piézomètre",null,null,null,null,null,"Mesures de chantier",null,null,null,null,null,null,null,null,null,null,null,null,"Résultats d'analyse en µg/l",null,null,null,null,null,null,null,null,null,null,null,null,null,null,null,null,null,null,null,null,null,null,null,null,null,null,"Remarques (couleur, turbidité, limpidité, …)"]
[null,null,null,null,null,null,null,null,null,null,null,null,null,null,null,null,null,null,null,"HM somme",null,"Hydrocarbures pétroliers\n(fractions globales/combinées)",null,null,null,null,null,"Hydrocarbures pétroliers\n(analyse 'split' aliphatique/aromatique)",null,null,null,null,null,null,null,null,null,null,null,null,null,"BTEXN/MTBE"]
[null,"Parcelle cadastrale","Code du piézomètre","X (Lambert)","Y (Lambert)","Profondeur de l'ouvrage (cm-ns)(5)","Profondeur de la crépine: de (cm-ns) à \n(cm-ns)","Date","Phase d'étude(4)","Niveau d’eau par rapport au sommet du piézomètre (cm-ns)(1)","Quantité prélevée avant échantilllonnage (litre)","Piézomètre bien ou mal alimenté(4)","Zone de captage (I, IIa, IIb)(4)","Nappe exploitable ou non-exploitable(4)","Température (°C)","Ec (µS/cm)","Odeur: type(4)","Odeur: intensité(4)","pH","Huile minérale EC 5-35","Huile minérale EC 10-40","Fraction\nEC 5-8","Fraction\nEC 8-10","Fraction\nEC 10-12","Fraction\nEC 12-16","Fraction\nEC 16-21","Fraction\nEC 21-35","Ali\nEC 5-6","Ali\nEC 6-8","Ali\nEC 8-10","Ali\nEC 10-12","Ali\nEC 12-16","Ali\nEC 16-21","Ali\nEC 21-35","Aro\nEC 6-7","Aro\nEC 7-8","Aro\nEC 8-10","Aro\nEC 10-12","Aro\nEC 12-16","Aro\nEC 16-21","Aro\nEC 21-35","Benzène","Toluène","Ethylbenzène","Xylènes (total)","MTBE","Naphtalène"]
[null,"Zone suspecte investiguée: "]
[null,"456e","P1",null,null,450,"200-400","2006-06-07","EO",2.4,null,"bien","IIb","Exploit.",null,null,"DI"," +",6.27,null,null,62,100,null,null,null,null,null,null,null,null,null,null,null,null,null,null,null,null,null,null,12,800,2.5,9,40,-0.05]
[]
[]
[]
[]
[]
[]
[]
[null,"Autre zone suspecte:"]
[]
[]
[]
[]
[]
[null,"Autre zone suspecte:"]
[]
[]
[]
[]
[]
[null,"Légende"]
[null,"Caractère gras et rouge= excède la  ",null,null,null,null,null,null,null,null,null,null,null,null,null,null,null,null,"VSnappe",null,null,60,200,200,200,300,300,null,null,null,null,null,null,null,null,null,null,null,null,null,null,10,700,300,500,300,60]
[null,null,null,null,null,null,null,null,null,null,null,null,null,null,"VLnappe",null,null,null,null,null,null,120,400,400,400,600,600,null,null,null,null,null,null,null,null,null,null,null,null,null,null,40,5850,1520,2175,1235,410]
[null,null,null,null,null,null,null,null,null,null,null,null,null,null,"VSnappe/volatilisation",null,null,null,null,null,null,null,null,null,null,null,null,8464,5578,189.7,126.7,29.12,21.76,0.2175,255.4,19770,6294,21360,55060,105900,916000,255.4,19770,517.79999999999995,7245,57510,596.20000000000005]
[]
[null,"Fond jaune = excède le",null,null,null,null,null,"Profil type(4)",null,null,null,"LIMON MCS-1",null,null,"Concent équil. eau BOF-SRA (ann. 5) (3)",null,null,null,null,{"$f":"INDEX(T$61:T$95,MATCH($L$33,$S$61:$S$95,0))","v":6276.6318490000003},4629.4418490000007,"-","-","-","-","-","-","-",35.36,43.83,19.7,0.44040000000000001,1.449E-3,"-","-","-",1568,871.7,3361,376.6,"-",63.53,4887,124.6,2020,15100,157.80000000000001]
[]
[null,"(1) S'il y a une couche surnageante, il convient d'en mentionner les parties supérieure et inférieure"]
[null,"(3) A adapter conformément à la législation et aux paramètres spécifiques au site"]
[null,"(4) Liste déroulante"]
[null,"(5) Si différente de la profondeur de la base de la crépine"]
[]
[null,null,null,null,null,null,null,null,"EO"]
[null,null,null,null,null,null,null,null,"EC",null,"data validation"]
[null,null,null,null,null,null,null,null,"PA",null,null,"bien","I","Exploit.",null,null,"Ess"," -"]
[null,null,null,null,null,null,null,null,"EF",null,null,"mal","IIa","Non Expl.",null,null,"DI"," +"]
[null,null,null,null,null,null,null,null,"MON",null,null,"insuffisam.","IIb","non défini",null,null,"HA"," ++"]
[null,null,null,null,null,null,null,null,"EI",null,null,"non défini","hors zone",null,null,null,"MC"]
[null,null,null,null,null,null,null,null,"autre/non défini",null,null,null,null,null,null,null,"AU"]
[]
[]
[]
[]
[]
[]
[]
[]
[]
[]
[]
[]
[null,null,null,null,null,null,null,null,null,null,null,null,null,"Dir annexe 5",null,null,null,null,null,"conc. En µg/l"]
[null,null,null,null,null,null,null,null,null,null,null,null,null,null,null,null,null,null,null,"Huile minérale EC5-35","Huile minérale EC10-40","Fraction\nEC 5-8","Fraction\nEC >8-10","Fraction\nEC >10-12","Fraction\nEC >12-16","Fraction\nEC >16-21","Fraction\nEC >21-35","ALI\nEC 5-6","ALI\nEC >6-8","ALI\nEC >8-10","ALI\nEC >10-12","ALI\nEC >12-16","ALI\nEC >16-21","ALI\nEC >21-35","Arom\nEC 6-7","Arom\nEC >7-8","Arom\nEC >8-10","Arom\nEC >10-12","Arom\nEC >12-16","Arom\nEC >16-21","Arom\nEC >21-35","Benzène","Toluène","Ethylbenzène","Xylènes (total)","MTBE","Naphtalène"]
[null,null,null,null,null,null,null,null,null,null,null,null,null,null,null,null,null,null,"LIMON MCS-1",6276.6318490000003,4629.4418490000007,"-","-","-","-","-","-","-",35.36,43.83,19.7,0.44040000000000001,1.449E-3,"-","-","-",1568,871.7,3361,376.6,"-",63.53,4887,124.6,2020,15100,157.80000000000001]
[null,null,null,null,null,null,null,null,null,null,null,null,null,null,null,null,null,null,"LIMON MCS-2",8560.4418490000007,5419.741849,"-","-","-","-","-","-","-",67.180000000000007,83.52,19.7,0.44040000000000001,1.449E-3,"-","-","-",2990,1662,3361,376.6,"-",122,9286,236.8,3838,28690,299.89999999999998]
[null,null,null,null,null,null,null,null,null,null,null,null,null,null,null,null,null,null,"LIMON MCS-3",4702.5918490000004,3544.0418489999997,"-","-","-","-","-","-","-",24.75,30.8,19.7,0.44040000000000001,1.449E-3,"-","-","-",1103,613.29999999999995,2534,376.6,"-",47.06,3601,95.26,1520,11330,118.4]
[null,null,null,null,null,null,null,null,null,null,null,null,null,null,null,null,null,null,"LIMON MCS-4",16305.941849000001,8098.741849,"-","-","-","-","-","-","-",175.9,218.3,19.7,0.44040000000000001,1.449E-3,"-","-","-",7813,4341,3361,376.6,"-",333.3,2572,649.9,10370,75510,841.8]
[null,null,null,null,null,null,null,null,null,null,null,null,null,null,null,null,null,null,"LIMON MCS-5",16227.741849,8072.741849,"-","-","-","-","-","-","-",175,217,19.7,0.44040000000000001,1.449E-3,"-","-","-",7763,4315,3361,376.6,"-",317.7,24310,658.8,10100,70980,776]
[null,null,null,null,null,null,null,null,null,null,null,null,null,null,null,null,null,null,"LIMON MCS-6",59285.941848999995,18247.741848999998,"-","-","-","-","-","-","-",3129,249.2,19.7,0.44040000000000001,1.449E-3,"-","-","-",37660,14490,3361,376.6,"-",5490,303100,11220,96190,1208000,14200]
[null,null,null,null,null,null,null,null,null,null,null,null,null,null,null,null,null,null,"LIMON MCS-7",59285.941848999995,18247.741848999998,"-","-","-","-","-","-","-",3129,249.2,19.7,0.44040000000000001,1.449E-3,"-","-","-",37660,14490,3361,376.6,"-",2745,216100,5698,86450,664500,6839]
[null,null,null,null,null,null,null,null,null,null,null,null,null,null,null,null,null,null,"LIMON SABLEUX MCS-1",4878.9718490000005,3673.5418489999997,"-","-","-","-","-","-","-",25.47,31.96,19.7,0.44040000000000001,1.449E-3,"-","-","-",1148,637.79999999999995,2639,376.6,"-",43.22,3188,81.72,1283,10810,108.8]
[null,null,null,null,null,null,null,null,null,null,null,null,null,null,null,null,null,null,"LIMON SABLEUX MCS-2",6847.5018490000002,4827.741849,"-","-","-","-","-","-","-",42.19,53.57,19.7,0.44040000000000001,1.449E-3,"-","-","-",1924,1070,3361,376.6,"-",122,9286,236.8,3838,28690,299.89999999999998]
[null,null,null,null,null,null,null,null,null,null,null,null,null,null,null,null,null,null,"LIMON SABLEUX MCS-3",2307.7118489999998,1754.761849,"-","-","-","-","-","-","-",11.59,14.66,17.62,0.44040000000000001,1.449E-3,"-","-","-",526.70000000000005,293,1210,233.7,"-",35.659999999999997,259.8,72.73,1116,8700,91.86]
[null,null,null,null,null,null,null,null,null,null,null,null,null,null,null,null,null,null,"LIMON SABLEUX MCS-4",11790.741849,6538.741849,"-","-","-","-","-","-","-",109.7,139.30000000000001,19.7,0.44040000000000001,1.449E-3,"-","-","-",5003,2781,3361,376.6,"-",210.7,16300,433.1,6717,50870,543.9]
[null,null,null,null,null,null,null,null,null,null,null,null,null,null,null,null,null,null,"LIMON SABLEUX MCS-5",12345.741849,6730.741849,"-","-","-","-","-","-","-",118.2,148.80000000000001,19.7,0.44040000000000001,1.449E-3,"-","-","-",5348,2973,3361,376.6,"-",219.7,17120,451.1,7018,50520,549.9]
[null,null,null,null,null,null,null,null,null,null,null,null,null,null,null,null,null,null,"LIMON SABLEUX MCS-6",59022.941848999995,18247.741848999998,"-","-","-","-","-","-","-",2866,249.2,19.7,0.44040000000000001,1.449E-3,"-","-","-",37660,14490,3361,376.6,"-",3206,283400,6538,96190,771800,8219]
[null,null,null,null,null,null,null,null,null,null,null,null,null,null,null,null,null,null,"LIMON SABLEUX MCS-7",59022.941848999995,18247.741848999998,"-","-","-","-","-","-","-",2866,249.2,19.7,0.44040000000000001,1.449E-3,"-","-","-",37660,14490,3361,376.6,"-",1675,129900,3269,48460,407000,3868]
[null,null,null,null,null,null,null,null,null,null,null,null,null,null,null,null,null,null,"ARGILE MCS-1",6979.0918490000004,4869.741849,"-","-","-","-","-","-","-",47.02,56.33,19.7,0.44040000000000001,1.449E-3,"-","-","-",2006,1112,3361,376.6,"-",79.64,5815,159.1,2385,17550,183.3]
[null,null,null,null,null,null,null,null,null,null,null,null,null,null,null,null,null,null,"ARGILE MCS-2",9912.1018490000006,5882.741849,"-","-","-","-","-","-","-",89.76,107.6,19.7,0.44040000000000001,1.449E-3,"-","-","-",3832,2125,3361,376.6,"-",159.30000000000001,11630,318.2,4771,35100,366.7]
[null,null,null,null,null,null,null,null,null,null,null,null,null,null,null,null,null,null,"ARGILE MCS-3",5672.4018489999999,4248.6418490000005,"-","-","-","-","-","-","-",31.74,38.020000000000003,19.7,0.44040000000000001,1.449E-3,"-","-","-",1354,750.9,3101,376.6,"-",55.38,4342,114,1762,12620,134.4]
[null,null,null,null,null,null,null,null,null,null,null,null,null,null,null,null,null,null,"ARGILE MCS-4",20939.541849000001,9708.741849,"-","-","-","-","-","-","-",251.6,249.2,19.7,0.44040000000000001,1.449E-3,"-","-","-",10730,5951,3361,376.6,"-",451.3,35200,944.5,14370,104200,1146]
[null,null,null,null,null,null,null,null,null,null,null,null,null,null,null,null,null,null,"ARGILE MCS-5",19673.641849,9263.741849,"-","-","-","-","-","-","-",232.7,249.2,19.7,0.44040000000000001,1.449E-3,"-","-","-",9928,5506,3361,376.6,"-",400.6,31790,837.9,13010,86660,924.3]
[null,null,null,null,null,null,null,null,null,null,null,null,null,null,null,null,null,null,"ARGILE MCS-6",58080.941848999995,18247.741848999998,"-","-","-","-","-","-","-",1924,249.2,19.7,0.44040000000000001,1.449E-3,"-","-","-",37660,14490,3361,376.6,"-",7602,303100,13520,96190,1810000,16040]
[null,null,null,null,null,null,null,null,null,null,null,null,null,null,null,null,null,null,"ARGILE MCS-7",58080.941848999995,18247.741848999998,"-","-","-","-","-","-","-",1924,249.2,19.7,0.44040000000000001,1.449E-3,"-","-","-",37660,14490,3361,376.6,"-",3644,267500,6395,94870,898400,7486]
[null,null,null,null,null,null,null,null,null,null,null,null,null,null,null,null,null,null,"LIMON CAILLOUTEUX MCS-1",5342.0818490000001,4007.0418489999997,"-","-","-","-","-","-","-",29.47,35.57,19.7,0.44040000000000001,1.449E-3,"-","-","-",1270,704.3,2906,376.6,"-",52.04,3836,105.3,1596,12290,134]
[null,null,null,null,null,null,null,null,null,null,null,null,null,null,null,null,null,null,"LIMON CAILLOUTEUX MCS-2",7617.9318490000005,5090.741849,"-","-","-","-","-","-","-",55.84,67.349999999999994,19.7,0.44040000000000001,1.449E-3,"-","-","-",2404,1333,3361,376.6,"-",87.03,6813,195.1,2793,21950,251.2]
[null,null,null,null,null,null,null,null,null,null,null,null,null,null,null,null,null,null,"LIMON CAILLOUTEUX MCS-3",2441.8918490000001,1854.5718489999999,"-","-","-","-","-","-","-",12.97,15.65,18.63,0.44040000000000001,1.449E-3,"-","-","-",558.70000000000005,309.89999999999998,1279,246.6,"-",38.76,3000,79.59,1197,9246,100.5]
[null,null,null,null,null,null,null,null,null,null,null,null,null,null,null,null,null,null,"LIMON CAILLOUTEUX MCS-4",13514.541848999999,7126.741849,"-","-","-","-","-","-","-",141.5,170.3,19.7,0.44040000000000001,1.449E-3,"-","-","-",6076,3369,3361,376.6,"-",254.8,19750,519.79999999999995,8138,60150,664.3]
[null,null,null,null,null,null,null,null,null,null,null,null,null,null,null,null,null,null,"LIMON CAILLOUTEUX MCS-5",12143.841849,6653.741849,"-","-","-","-","-","-","-",121.8,146.30000000000001,19.7,0.44040000000000001,1.449E-3,"-","-","-",5222,2896,3361,376.6,"-",215.3,16830,448.7,6942,50050,547.1]
[null,null,null,null,null,null,null,null,null,null,null,null,null,null,null,null,null,null,"LIMON CAILLOUTEUX MCS-6",57552.941848999995,18247.741848999998,"-","-","-","-","-","-","-",1396,249.2,19.7,0.44040000000000001,1.449E-3,"-","-","-",37660,14490,3361,376.6,"-",4127,303100,8583,96190,987800,11050]
[null,null,null,null,null,null,null,null,null,null,null,null,null,null,null,null,null,null,"LIMON CAILLOUTEUX MCS-7",57552.941848999995,18247.741848999998,"-","-","-","-","-","-","-",1396,249.2,19.7,0.44040000000000001,1.449E-3,"-","-","-",37660,14490,3361,376.6,"-",2064,160300,4350,63830,500500,5504]
[null,null,null,null,null,null,null,null,null,null,null,null,null,null,null,null,null,null,"SABLE MCS-1",1228.896849,933.59184900000002,"-","-","-","-","-","-","-",6.2220000000000004,7.7830000000000004,9.35,0.44040000000000001,1.449E-3,"-","-","-",281.3,156,643.70000000000005,124.1,"-",16.97,1285,31.91,519.6,4119,41.21]
[null,null,null,null,null,null,null,null,null,null,null,null,null,null,null,null,null,null,"SABLE MCS-2",2202.1618490000001,1673.1018489999999,"-","-","-","-","-","-","-",11.11,13.95,16.760000000000002,0.44040000000000001,1.449E-3,"-","-","-",504,279.60000000000002,1154,222.3,"-",33.93,2677,65.27,1024,8827,90.66]
[null,null,null,null,null,null,null,null,null,null,null,null,null,null,null,null,null,null,"SABLE MCS-3",1037.3138489999999,788.13384900000005,"-","-","-","-","-","-","-",5.2279999999999998,6.5519999999999996,7.8920000000000003,0.44040000000000001,1.449E-3,"-","-","-",237.4,131.69999999999999,543.4,104.7,"-",15.78,1189,30.46,467.6,4021,39.15]
[null,null,null,null,null,null,null,null,null,null,null,null,null,null,null,null,null,null,"SABLE MCS-4",6827.5918490000004,4818.741849,"-","-","-","-","-","-","-",41.93,52.92,19.7,0.44040000000000001,1.449E-3,"-","-","-",1914,1061,3361,376.6,"-",76.349999999999994,5997,159.5,2449,18630,206]
[null,null,null,null,null,null,null,null,null,null,null,null,null,null,null,null,null,null,"SABLE MCS-5",8556.4618489999993,5416.741849,"-","-","-","-","-","-","-",65.94,82.78,19.7,0.44040000000000001,1.449E-3,"-","-","-",2991,1659,3361,376.6,"-",120.5,9531,224.8,3786,28440,298.8]
[null,null,null,null,null,null,null,null,null,null,null,null,null,null,null,null,null,null,"SABLE MCS-6",21427.441848999999,9884.741849,"-","-","-","-","-","-","-",243.5,249.2,19.7,0.44040000000000001,1.449E-3,"-","-","-",11050,6127,3361,376.6,"-",509,36410,870.3,13360,127500,989]
[null,null,null,null,null,null,null,null,null,null,null,null,null,null,null,null,null,null,"SABLE MCS-7",14390.241849,7433.741849,"-","-","-","-","-","-","-",146.1,183.4,19.7,0.44040000000000001,1.449E-3,"-","-","-",6627,3676,3361,376.6,"-",240.9,17780,406.1,6383,61790,490.4]

{"sheet":"Eau Wal DS TV","index":9,"n_rows":44,"n_cols":85,"rows_kept":44,"cut":false,"hidden":false,"merged":[[3,19,3,47],[7,1,7,18],[16,1,16,18],[22,1,22,18],[1,1,1,84],[4,48,4,56],[4,73,4,82],[4,19,4,20],[4,21,4,26],[4,27,4,40],[4,41,4,47],[3,1,4,6],[3,7,4,18],[3,84,5,84],[2,2,2,84]]}
[]
[null,"Perceptions de chantier et comparaison des résultats d'analyse (DS) pour l'eau souterraine"]
[null,"Projet:",{"$f":"'Manuel d''utilisation'!C3","v":"BOF_SL_6000: Rue de la Station, 666 à 4308 Manage"}]
[null,"Identification du piézomètre",null,null,null,null,null,"Mesures de chantier",null,null,null,null,null,null,null,null,null,null,null,"Résultats d'analyse en µg/l",null,null,null,null,null,null,null,null,null,null,null,null,null,null,null,null,null,null,null,null,null,null,null,null,null,null,null,null,null,null,null,null,null,null,null,null,null,null,null,null,null,null,null,null,null,null,null,null,null,null,null,null,null,null,null,null,null,null,null,null,null,null,null,null,"Remarques (couleur, turbidité, limpidité, …)"]
[null,null,null,null,null,null,null,null,null,null,null,null,null,null,null,null,null,null,null,"HM somme",null,"Hydrocarbures pétroliers\n(fractions globales/combinées)",null,null,null,null,null,"Hydrocarbures pétroliers\n(analyse 'split' aliphatique/aromatique)",null,null,null,null,null,null,null,null,null,null,null,null,null,"BTEXS/MTBE/Phénol",null,null,null,null,null,null,"Métaux/métalloïdes",null,null,null,null,null,null,null,null,null,null,null,null,null,null,"Hydrocarbures aromatiques polycycliques non halogénés",null,null,null,null,null,null,null,null,null,"Hydrocarbures chlorés",null,null,null,null,null,null,null,null,null,"Autres"]
[null,"Parcelle cadastrale","Code du piézomètre","X (Lambert)","Y (Lambert)","Profondeur de l'ouvrage (cm-ns)(4)","Prof. de la crépine: de (cm-ns) à \n(cm-ns)","Date","Phase d'étude(3)","Niveau d’eau par rapport au sommet du piézomètre (cm-ns)(1)","Quantité prélevée avant échantilllonnage (litre)","Piézomètre bien ou mal alimenté(3)","Zone de captage (I, IIa, IIb)(3)","Nappe exploitable ou non-exploitable(3)","Température (°C)","Ec (µS/cm)","Odeur : type(3)","Odeur : intensité(3)","pH","Huile minérale EC 5-35","Huile minérale EC 10-40","Fraction\nEC 5-8","Fraction\nEC 8-10","Fraction\nEC 10-12","Fraction\nEC 12-16","Fraction\nEC 16-21","Fraction\nEC 21-35","Ali\nEC 5-6","Ali\nEC 6-8","Ali\nEC 8-10","Ali\nEC 10-12","Ali\nEC 12-16","Ali\nEC 16-21","Ali\nEC 21-35","Aro\nEC 6-7","Aro\nEC 7-8","Aro\nEC 8-10","Aro\nEC 10-12","Aro\nEC 12-16","Aro\nEC 16-21","Aro\nEC 21-35","Benzène","Toluène","Ethylbenzène","Xylènes (total)","MTBE","Styrènes","Phénol","Arsenic","Cadmium","Chrome total","Chrome VI","Cuivre","Mercure","Nickel","Plomb","Zinc","Naphtalène","Acénaphtylène","Acénaphtène","Fluorène","Phénanthrène","Anthracène","Fluoranthène","Pyrène","Benzo(a)anthracène","Chrysène","Benzo(b)fluoranthène","Benzo(k)fluoranthène","Benzo(a)pyrène","Dibenzo(ah)anthracène","Benzo(ghi)pérylène","Indéno(1,2,3-cd)pyrène","Dichlorométhane","Trichlorométhane","Tetrachlorométhane","Tetrachloroéthène \n(PCE)","Trichloroéthène\n(TCE)","1,2-Dichloroéthène \nsomme (DCE)","Chloroéthène \n(VC)","1,1,1-Trichloroéthane \n(1,1,1-TCA)","1,1,2-Trichloroéthane \n(1,1,2-TCA)","1,2-Dichloroéthane\n(1,2-DCA)","Cyanures libres"]
[null,"NORMES:  Concentrations en gras et rouge si dépassement de la norme",null,null,null,null,null,null,null,null,null,null,null,"VSnappe",null,null,null,null,null,null,null,60,200,200,200,300,300,null,null,null,null,null,null,null,null,null,null,null,null,null,null,10,700,300,500,300,20,120,10,5,50,9,100,1,20,10,200,60,70,180,120,120,75,4,90,7,1.5,1.5,0.8,0.7,0.7,0.3,0.22,20,200,2,40,70,50,5,500,12,30,70]
[null,"Zone suspecte investiguée: "]
[null,"456e","P1",null,null,null,"200-400","2006-06-07","EC",2.4,null,"bien","hors zone","non défini",null,null,"DI"," ++",6.27,null,null,null,null,null,null,null,null,null,null,null,null,null,null,null,null,null,null,null,null,null,null,null,68,2.5,9,40,null,-0.05]
[]
[]
[]
[]
[]
[]
[]
[null,"Autre zone suspecte:"]
[]
[]
[]
[]
[]
[null,"Autre zone suspecte:"]
[]
[]
[]
[]
[]
[null,"Légende"]
[]
[null,"(1) S'il y a une couche surnageante, il convient d'en mentionner les parties supérieure et inférieure"]
[null,"(3) Liste déroulante"]
[null,"(4) Si différente de la profondeur de la base de la crépine"]
[]
[]
[]
[null,null,null,null,null,null,null,"data validation"]
[null,null,null,null,null,null,null,null,"EO",null,"data validation"]
[null,null,null,null,null,null,null,null,"EC",null,null,"bien","I","Exploit.",null,null,"Ess"," -"]
[null,null,null,null,null,null,null,null,"PA",null,null,"mal","IIa","Non Expl.",null,null,"DI"," +"]
[null,null,null,null,null,null,null,null,"EF",null,null,"insuffisam.","IIb","non défini",null,null,"HA"," ++"]
[null,null,null,null,null,null,null,null,"MON",null,null,"non défini","hors zone",null,null,null,"MC"]
[null,null,null,null,null,null,null,null,"EI",null,null,null,null,null,null,null,"AU"]
[null,null,null,null,null,null,null,null,"autre/non défini"]

{"sheet":"Eau Wal RGPT","index":10,"n_rows":45,"n_cols":37,"rows_kept":45,"cut":false,"hidden":false,"merged":[[24,1,24,17],[1,1,1,36],[2,2,2,36],[3,1,3,6],[3,7,3,17],[3,18,3,35],[3,36,4,36],[5,13,5,17],[6,13,6,17],[7,1,7,17],[16,1,16,17]]}
[]
[null,"Perceptions de chantier et comparaison des résultats d'analyse (RGPT) pour l'eau souterraine"]
[null,"Projet:",{"$f":"'Manuel d''utilisation'!C3","v":"BOF_SL_6000: Rue de la Station, 666 à 4308 Manage"}]
[null,"Identification du piézomètre",null,null,null,null,null,"Mesures de chantier",null,null,null,null,null,null,null,null,null,null,"Résultats d'analyse en µg/l",null,null,null,null,null,null,null,null,null,null,null,null,null,null,null,null,null,"Remarques (couleur, turbidité, limpidité, …)"]
[null,"Parcelle cadastrale","Code du piézomètre","X (Lambert)","Y (Lambert)","Profondeur de l'ouvrage (cm-ns)(5)","Prof. de la crépine: de (cm-ns) à \n(cm-ns)","Date","Niveau d’eau par rapport au sommet du piézomètre (cm-ns)(1)","Quantité prélevée avant échantilllonnage (litre)","Zone de captage (I, IIa, IIb)(4)","Piézomètre bien ou mal alimenté(4)","Nappe exploitable ou non-exploitable(4)","Température (°C)","Ec (µS/cm)","Odeur : type(4)","Odeur : intensité(4)","pH","Huile minérale EC 5-35","Huile minérale EC 10-40","Benzène","Toluène","Ethylbenzène","Xylènes","MTBE","Naphtalène","Napthalène","Anthracène","Phénantrène ","Fluoranthène","Benzo(a)anthracène","Benzo(k)fluoranthène","Benzo(ghi)pérylène","Indéno(1,2,3-cd)pyrène","Chrysène ","Benzo(a)pyrène"]
[null,"NORMES: Concentrations en gras et rouge si > à VI",null,null,null,null,null,null,null,null,null,null,null,"VI (RGPT)",null,null,null,null,null,500,120,5500,3400,3300,300,125,125,8,30,30,7,500,500,500,50,50]
[null,"NORMES: Concentrations en souligné si > à VR",null,null,null,null,null,null,null,null,null,null,null,"VR (RGPT)",null,null,null,null,null,50,10,20,50,20,null,14,14,0.2,7,7,0.5,0.05,0.05,0.05,5.0000000000000001E-3,5.0000000000000001E-3]
[null,"Zone suspecte investiguée: "]
[null,"456e","P1",null,null,null,"200-400","2006-06-07",2.4,null,"IIa","bien","Exploit.",null,null,"Ess"," +",6.27,400,600,130,2000,5000,4000,500,-0.05,-0.05,-0.05,-0.05,-0.05,-0.05,-0.05,-0.05,-0.05,-0.05,-0.05]
[]
[]
[]
[]
[]
[]
[]
[null,"Autre zone suspecte:"]
[]
[]
[]
[]
[]
[]
[]
[null,"Autre zone suspecte:"]
[]
[]
[]
[]
[]
[]
[]
[null,"Légende"]
[null,"(1) S'il y a une couche surnageante, il convient d'en mentionner les parties supérieure et inférieure"]
[null,"(3) A adapter conformément à la législation et aux paramètres spécifiques au site"]
[null,"(4) Liste déroulante"]
[null,"(5) Si différente de la profondeur de la base de la crépine"]
[]
[]
[null,null,null,null,null,null,null,null,null,null,"data validation"]
[null,null,null,null,null,null,null,null,null,null,"I","bien","Exploit.",null,null,"Ess"," -"]
[null,null,null,null,null,null,null,null,null,null,"IIa","mal","Non Expl.",null,null,"DI"," +"]
[null,null,null,null,null,null,null,null,null,null,"IIb","insuffisam.","non défini",null,null,"HA"," ++"]
[null,null,null,null,null,null,null,null,null,null,"hors zone","non défini",null,null,null,"MC"]
[null,null,null,null,null,null,null,null,null,null,null,null,null,null,null,"AU"]

{"sheet":"Air du sol","index":11,"n_rows":103,"n_cols":40,"rows_kept":103,"cut":false,"hidden":false,"merged":[[20,2,20,10],[20,11,20,24],[20,25,20,38],[18,1,18,38],[59,1,59,2],[57,1,57,2],[19,2,19,38],[32,1,32,10],[44,1,44,10],[56,1,56,10],[32,11,32,24],[44,11,44,24],[56,11,56,24],[3,2,3,10],[3,11,3,24],[3,25,3,38],[1,1,1,38],[2,2,2,38]]}
[]
[null,"Observations de terrain comparaison des résultats d'analyse de l'air du sol"]
[null,"Projet:",{"$f":"'Manuel d''utilisation'!C3","v":"BOF_SL_6000: Rue de la Station, 666 à 4308 Manage"}]
[null,null,"Données relatives à l'échantillonnage",null,null,null,null,null,null,null,null,"Résultats d'analyse (µg/tube)",null,null,null,null,null,null,null,null,null,null,null,null,null,"Concentrations calculées (mg/Nm3)"]
[null,"Date de l'échantillonnage","Point d'échantillonnage","Début\n(xx:xx)","Fin (xx:xx)","Durée de l'échantillonnage (min)","Débit \n(ml/min)","Volume pompé via le CA (litre)","Température (1)\n(°C)","Pression (1)\n(HPa)","Volume pompé via le CA (Nm³)","TPH aliphatique\n EC >5-6","TPH aliphatique \nEC >6-8","TPH aliphatique \nEC >8-10","TPH aliphatique \nEC >10-12","TPH aliphatique\nEC >12-16","TPH aromatique \nEC >8-10","TPH aromatique \nEC >10-12","TPH aromatique \nEC >12-16","Benzène","Toluène","Ethylbenzène","Xylènes","Naphthalène","MTBE","TPH aliphatique EC 5-6","TPH aliphatique EC >6-8","TPH aliphatique EC >8-10","TPH aliphatique EC >10-12","TPH aliphatique EC >12-16","TPH aromatique EC >8-10","TPH aromatique EC >10-12","TPH aromatique EC >12-16","Benzène","Toluène","Ethyl-benzène","Xylènes","Naphthalène","MTBE"]
[null,"2015-12-17","BL1","15:20:00","15:40:00",{"$f":"MINUTE(E6-D6)","v":20},106.16,{"$f":"(F6)*G6/1000","v":2.1231999999999998},10,1000,{"$f":"+H6/1000*273/(273+I6)*J6/1013","v":2.0218906860983883E-3},50000,50000,50000,50000,50000,50000,50000,50000,1000,1000,1000,1000,1000,1000,{"$f":"IF(ISBLANK(L6),\"\",+L6/$K6/1000)","v":24729.329010602567},24729.329010602567,24729.329010602567,24729.329010602567,24729.329010602567,24729.329010602567,24729.329010602567,24729.329010602567,494.58658021205133,494.58658021205133,494.58658021205133,494.58658021205133,494.58658021205133,494.58658021205133]
[null,"2016-03-10","BL2","16:20:00","16:40:00",20,107.16,2.1431999999999998,10,800,1.6327491026548856E-3,50000,50000,50000,50000,50000,50000,50000,50000,1000,1000,1000,1000,1000,1000,{"$f":"IF(ISBLANK(L7),\"\",+L7/$K7/1000)","v":30623.198578825682},{"$f":"IF(ISBLANK(M7),\"\",+M7/$K7/1000)","v":30623.198578825682},{"$f":"IF(ISBLANK(N7),\"\",+N7/$K7/1000)","v":30623.198578825682},{"$f":"IF(ISBLANK(O7),\"\",+O7/$K7/1000)","v":30623.198578825682},{"$f":"IF(ISBLANK(P7),\"\",+P7/$K7/1000)","v":30623.198578825682},{"$f":"IF(ISBLANK(Q7),\"\",+Q7/$K7/1000)","v":30623.198578825682},{"$f":"IF(ISBLANK(R7),\"\",+R7/$K7/1000)","v":30623.198578825682},{"$f":"IF(ISBLANK(S7),\"\",+S7/$K7/1000)","v":30623.198578825682},{"$f":"IF(ISBLANK(T7),\"\",+T7/$K7/1000)","v":612.46397157651359},{"$f":"IF(ISBLANK(U7),\"\",+U7/$K7/1000)","v":612.46397157651359},{"$f":"IF(ISBLANK(V7),\"\",+V7/$K7/1000)","v":612.46397157651359},{"$f":"IF(ISBLANK(W7),\"\",+W7/$K7/1000)","v":612.46397157651359},{"$f":"IF(ISBLANK(X7),\"\",+X7/$K7/1000)","v":612.46397157651359},{"$f":"IF(ISBLANK(Y7),\"\",+Y7/$K7/1000)","v":612.46397157651359}]
[null,"2016-04-29","BL1","17:00:00","17:40:00",40,108.16,4.3263999999999996,14,900,3.6562887342595036E-3,50000,50000,50000,50000,50000,50000,50000,50000,1000,1000,1000,1000,1000,1000,13675.068801733007,13675.068801733007,13675.068801733007,13675.068801733007,13675.068801733007,13675.068801733007,13675.068801733007,13675.068801733007,273.50137603466015,273.50137603466015,273.50137603466015,273.50137603466015,273.50137603466015,273.50137603466015]
[null,"2016-08-05","BL2","18:00:00","18:40:00",40,109.16,4.3663999999999996,20,900,3.6145281308855182E-3,50000,50000,50000,50000,50000,50000,50000,50000,1000,1000,1000,1000,1000,1000,13833.064286527095,13833.064286527095,13833.064286527095,13833.064286527095,13833.064286527095,13833.064286527095,13833.064286527095,13833.064286527095,276.66128573054192,276.66128573054192,276.66128573054192,276.66128573054192,276.66128573054192,276.66128573054192]
[null,"2017-02-07","BL1","19:00:00","19:40:00",40,110.16,4.4063999999999997,10,600,2.5176881459751154E-3,50000,50000,50000,50000,50000,50000,50000,50000,1000,1000,1000,1000,1000,1000,19859.48898394432,19859.48898394432,19859.48898394432,19859.48898394432,19859.48898394432,19859.48898394432,19859.48898394432,19859.48898394432,397.18977967888634,397.18977967888634,397.18977967888634,397.18977967888634,397.18977967888634,397.18977967888634]
[null,"2017-06-16","BL2","20:00:00","20:40:00",40,111.16,4.4463999999999997,10,900,3.8108144649590656E-3,50000,50000,50000,50000,50000,50000,50000,50000,1000,1000,1000,1000,1000,1000,13120.554794718164,13120.554794718164,13120.554794718164,13120.554794718164,13120.554794718164,13120.554794718164,13120.554794718164,13120.554794718164,262.41109589436326,262.41109589436326,262.41109589436326,262.41109589436326,262.41109589436326,262.41109589436326]
[null,null,null,null,null,null,null,null,null,null,null,null,null,null,null,null,null,null,null,null,null,null,null,null,null,{"$f":"IF(ISBLANK(L12),\"\",+L12/$K12/1000)","v":""},"","","","","","","","","","","","",""]
[null,null,null,null,null,null,null,null,null,null,null,null,null,null,null,null,null,null,null,null,null,null,null,null,null,"","","","","","","","","","","","","",""]
[null,null,null,null,null,null,null,null,null,null,null,null,null,null,null,null,null,null,null,null,null,null,null,null,null,"","","","","","","","","","","","","",""]
[]
[null,"(1) Ces paramètres sont mesurés au niveau de et lors de la mesure du volume"]
[]
[]
[null,"Comparaison des mesures de l'air du sol aux valeurs de screening pour l'air du sol conformément à l'annexe 8 de la Directive (comparaison par MCS)"]
[null,"Projet:",{"$f":"'Manuel d''utilisation'!C3","v":"BOF_SL_6000: Rue de la Station, 666 à 4308 Manage"}]
[null,null,"Données relatives à l'échantillonnage",null,null,null,null,null,null,null,null,"Résultats d'analyse (µg/tube)",null,null,null,null,null,null,null,null,null,null,null,null,null,"Concentrations calculées (mg/Nm3)"]
[null,"Date de l'échantillonnage","Point d'échantillonnage","Début\n(xx:xx)","Fin (xx:xx)","Durée de l'échantillonnage (min)","Débit \n(ml/min)","Volume pompé via le CA (litre)","Température (1)\n(°C)","Pression (1)\n(HPa)","Volume pompé via le CA (Nm³)","TPH aliphatique\n EC >5-6","TPH aliphatique \nEC >6-8","TPH aliphatique \nEC >8-10","TPH aliphatique \nEC >10-12","TPH aliphatique\nEC >12-16","TPH aromatique \nEC >8-10","TPH aromatique \nEC >10-12","TPH aromatique \nEC >12-16","Benzène","Toluène","Ethylbenzène","Xylènes","Naphthalène","MTBE","TPH aliphatique EC 5-6","TPH aliphatique EC >6-8","TPH aliphatique EC >8-10","TPH aliphatique EC >10-12","TPH aliphatique EC >12-16","TPH aromatique EC >8-10","TPH aromatique EC >10-12","TPH aromatique EC >12-16","Benzène","Toluène","Ethyl-benzène","Xylènes","Naphthalène","MTBE"]
[null,"                      MCS 1 : (2)","A-air1"]
[null,"2015-12-17","BL1","15:20:00","15:40:00",{"$f":"MINUTE(E24-D24)","v":20},106.16,{"$f":"(F24)*G24/1000","v":2.1231999999999998},10,1000,{"$f":"+H24/1000*273/(273+I24)*J24/1013","v":2.0218906860983883E-3},10000000,10000000,10000000,10000000,5,6,7,8,50000,50000,50000,50000,50000,50000,{"$f":"IF(ISBLANK(L24),\"\",+L24/$K24/1000)","v":4945865.8021205133},{"$f":"IF(ISBLANK(M24),\"\",+M24/$K24/1000)","v":4945865.8021205133},4945865.8021205133,4945865.8021205133,2.4729329010602563,2.967519481272308,3.4621060614843593,3.9566926416964106,{"$f":"IF(ISBLANK(T24),\"\",+T24/$K24/1000)","v":24729.329010602567},24729.329010602567,24729.329010602567,24729.329010602567,24729.329010602567,24729.329010602567]
[null,"2016-03-10","BL2","16:20:00","16:40:00",{"$f":"MINUTE(E25-D25)","v":20},107.16,{"$f":"(F25)*G25/1000","v":2.1431999999999998},10,800,{"$f":"+H25/1000*273/(273+I25)*J25/1013","v":1.6327491026548856E-3},1,100,1000,10000,100000,1000000,50000,50000,50000,50000,50000,50000,50000,50000,0.61246397157651356,{"$f":"IF(ISBLANK(M25),\"\",+M25/$K25/1000)","v":61.246397157651366},612.46397157651359,6124.6397157651363,61246.397157651365,612463.97157651361,30623.198578825682,30623.198578825682,30623.198578825682,30623.198578825682,30623.198578825682,30623.198578825682,30623.198578825682,30623.198578825682]
[null,"2016-03-10","BL2","16:20:00","16:40:00",{"$f":"MINUTE(E26-D26)","v":20},107.16,{"$f":"(F26)*G26/1000","v":2.1431999999999998},10,800,{"$f":"+H26/1000*273/(273+I26)*J26/1013","v":1.6327491026548856E-3},50000,50000,50000,50000,50000,50000,50000,50000,1000,1000,1000,1000,1000,1000,30623.198578825682,30623.198578825682,30623.198578825682,30623.198578825682,30623.198578825682,30623.198578825682,30623.198578825682,30623.198578825682,612.46397157651359,612.46397157651359,612.46397157651359,612.46397157651359,612.46397157651359,612.46397157651359]
[null,null,null,null,null,null,null,null,null,null,null,null,null,null,null,null,null,null,null,null,null,null,null,null,null,"",{"$f":"IF(ISBLANK(M27),\"\",+M27/$K27/1000)","v":""},"","","","","","","","","","","",""]
[null,null,null,null,null,null,null,null,null,null,null,null,null,null,null,null,null,null,null,null,null,null,null,null,null,"","","","","","","","","","","","","",""]
[null,null,null,null,null,null,null,null,null,null,null,null,null,null,null,null,null,null,null,null,null,null,null,null,null,"","","","","","","","","","","","","",""]
[null,null,null,null,null,null,null,null,null,null,null,null,null,null,null,null,null,null,null,null,null,null,null,null,null,"","","","","","","","","","","","","",""]
[null,null,null,null,null,null,null,null,null,null,null,null,null,null,null,null,null,null,null,null,null,null,null,null,null,"","","","","","","","","","","","","",""]
[null,null,null,null,null,null,null,null,null,null,null,null,null,null,null,null,null,null,null,null,null,null,null,null,null,{"$f":"IF(ISBLANK(L32),\"\",+L32/$K32/1000)","v":""},"","","","","","","","","","","","",""]
[null,"Valeurs de screening BOFAS pour l'air du sol : annexe 8 de la Directive (en mg/Nm3)",null,null,null,null,null,null,null,null,null,null,null,null,null,null,null,null,null,null,null,null,null,null,null,{"$f":"INDEX(Z$62:Z$73,MATCH($C$23,$AN$62:$AN$73,0))","v":95000},95000,5000,5000,5000,1050,1050,1050,18.149999999999999,1653,52.5,735,4.1500000000000004,370]
[]
[null,"                     MCS 2 : (2)","A-air1"]
[null,"2016-04-29","BL1","17:00:00","17:40:00",{"$f":"MINUTE(E36-D36)","v":40},108.16,{"$f":"(F36)*G36/1000","v":4.3263999999999996},14,900,{"$f":"+H36/1000*273/(273+I36)*J36/1013","v":3.6562887342595036E-3},50000,1,50000,50000,50000,50000,50000,50000,50000,50000,50000,50000,50000,50000,{"$f":"IF(ISBLANK(L36),\"\",+L36/$K36/1000)","v":13675.068801733007},{"$f":"IF(ISBLANK(M36),\"\",+M36/$K36/1000)","v":0.27350137603466007},13675.068801733007,13675.068801733007,13675.068801733007,13675.068801733007,13675.068801733007,13675.068801733007,13675.068801733007,13675.068801733007,13675.068801733007,13675.068801733007,13675.068801733007,13675.068801733007]
[null,"2016-08-05","BL2","18:00:00","18:40:00",{"$f":"MINUTE(E37-D37)","v":40},109.16,{"$f":"(F37)*G37/1000","v":4.3663999999999996},20,900,{"$f":"+H37/1000*273/(273+I37)*J37/1013","v":3.6145281308855182E-3},50000,50000,50000,50000,50000,50000,50000,50000,50000,50000,50000,50000,50000,50000,{"$f":"IF(ISBLANK(L37),\"\",+L37/$K37/1000)","v":13833.064286527095},{"$f":"IF(ISBLANK(M37),\"\",+M37/$K37/1000)","v":13833.064286527095},13833.064286527095,13833.064286527095,13833.064286527095,13833.064286527095,13833.064286527095,13833.064286527095,13833.064286527095,13833.064286527095,13833.064286527095,13833.064286527095,13833.064286527095,13833.064286527095]
[null,null,null,null,null,null,null,null,null,null,null,null,null,null,null,null,null,null,null,null,null,null,null,null,null,{"$f":"IF(ISBLANK(L38),\"\",+L38/$K38/1000)","v":""},{"$f":"IF(ISBLANK(M38),\"\",+M38/$K38/1000)","v":""},{"$f":"IF(ISBLANK(N38),\"\",+N38/$K38/1000)","v":""},{"$f":"IF(ISBLANK(O38),\"\",+O38/$K38/1000)","v":""},{"$f":"IF(ISBLANK(P38),\"\",+P38/$K38/1000)","v":""},{"$f":"IF(ISBLANK(Q38),\"\",+Q38/$K38/1000)","v":""},{"$f":"IF(ISBLANK(R38),\"\",+R38/$K38/1000)","v":""},{"$f":"IF(ISBLANK(S38),\"\",+S38/$K38/1000)","v":""},{"$f":"IF(ISBLANK(T38),\"\",+T38/$K38/1000)","v":""},{"$f":"IF(ISBLANK(U38),\"\",+U38/$K38/1000)","v":""},{"$f":"IF(ISBLANK(V38),\"\",+V38/$K38/1000)","v":""},{"$f":"IF(ISBLANK(W38),\"\",+W38/$K38/1000)","v":""},{"$f":"IF(ISBLANK(X38),\"\",+X38/$K38/1000)","v":""},{"$f":"IF(ISBLANK(Y38),\"\",+Y38/$K38/1000)","v":""}]
[null,null,null,null,null,null,null,null,null,null,null,null,null,null,null,null,null,null,null,null,null,null,null,null,null,"","","","","","","","","","","","","",""]
[null,null,null,null,null,null,null,null,null,null,null,null,null,null,null,null,null,null,null,null,null,null,null,null,null,"","","","","","","","","","","","","",""]
[null,null,null,null,null,null,null,null,null,null,null,null,null,null,null,null,null,null,null,null,null,null,null,null,null,"","","","","","","","","","","","","",""]
[null,null,null,null,null,null,null,null,null,null,null,null,null,null,null,null,null,null,null,null,null,null,null,null,null,"","","","","","","","","","","","","",""]
[null,null,null,null,null,null,null,null,null,null,null,null,null,null,null,null,null,null,null,null,null,null,null,null,null,"","","","","","","","","","","","","",""]
[null,null,null,null,null,null,null,null,null,null,null,null,null,null,null,null,null,null,null,null,null,null,null,null,null,{"$f":"IF(ISBLANK(L44),\"\",+L44/$K44/1000)","v":""},"","","","","","","","","","","","",""]
[null,"Valeurs de screening BOFAS pour l'air du sol : annexe 8 de la Directive (en mg/Nm3)",null,null,null,null,null,null,null,null,null,null,null,null,null,null,null,null,null,null,null,null,null,null,null,{"$f":"INDEX(Z$62:Z$73,MATCH($C$35,$AN$62:$AN$73,0))","v":95000},{"$f":"INDEX(AA$62:AA$73,MATCH($C$35,$AN$62:$AN$73,0))","v":95000},5000,5000,5000,1050,1050,1050,18.149999999999999,1653,52.5,735,4.1500000000000004,370]
[]
[null,"                      MCS 3 : (2)","A-air1"]
[null,"2016-04-29","BL1","17:00:00","17:40:00",40,108.16,4.3263999999999996,14,900,3.6562887342595036E-3,50000,50000,50000,50000,50000,50000,50000,50000,50000,50000,50000,50000,50000,50000,{"$f":"IF(ISBLANK(L48),\"\",+L48/$K48/1000)","v":13675.068801733007},{"$f":"IF(ISBLANK(M48),\"\",+M48/$K48/1000)","v":13675.068801733007},13675.068801733007,13675.068801733007,13675.068801733007,13675.068801733007,13675.068801733007,13675.068801733007,13675.068801733007,13675.068801733007,13675.068801733007,13675.068801733007,13675.068801733007,13675.068801733007]
[null,"2016-08-05","BL2","18:00:00","18:40:00",40,109.16,4.3663999999999996,20,900,3.6145281308855182E-3,50000,50000,50000,50000,50000,50000,50000,50000,50000,50000,50000,50000,50000,50000,{"$f":"IF(ISBLANK(L49),\"\",+L49/$K49/1000)","v":13833.064286527095},{"$f":"IF(ISBLANK(M49),\"\",+M49/$K49/1000)","v":13833.064286527095},{"$f":"IF(ISBLANK(N49),\"\",+N49/$K49/1000)","v":13833.064286527095},{"$f":"IF(ISBLANK(O49),\"\",+O49/$K49/1000)","v":13833.064286527095},{"$f":"IF(ISBLANK(P49),\"\",+P49/$K49/1000)","v":13833.064286527095},{"$f":"IF(ISBLANK(Q49),\"\",+Q49/$K49/1000)","v":13833.064286527095},{"$f":"IF(ISBLANK(R49),\"\",+R49/$K49/1000)","v":13833.064286527095},{"$f":"IF(ISBLANK(S49),\"\",+S49/$K49/1000)","v":13833.064286527095},{"$f":"IF(ISBLANK(T49),\"\",+T49/$K49/1000)","v":13833.064286527095},{"$f":"IF(ISBLANK(U49),\"\",+U49/$K49/1000)","v":13833.064286527095},{"$f":"IF(ISBLANK(V49),\"\",+V49/$K49/1000)","v":13833.064286527095},{"$f":"IF(ISBLANK(W49),\"\",+W49/$K49/1000)","v":13833.064286527095},{"$f":"IF(ISBLANK(X49),\"\",+X49/$K49/1000)","v":13833.064286527095},{"$f":"IF(ISBLANK(Y49),\"\",+Y49/$K49/1000)","v":13833.064286527095}]
[null,null,null,null,null,null,null,null,null,null,null,null,null,null,null,null,null,null,null,null,null,null,null,null,null,"","","","","","","","","","","","","",""]
[null,null,null,null,null,null,null,null,null,null,null,null,null,null,null,null,null,null,null,null,null,null,null,null,null,"","","","","","","","","","","","","",""]
[null,null,null,null,null,null,null,null,null,null,null,null,null,null,null,null,null,null,null,null,null,null,null,null,null,"","","","","","","","","","","","","",""]
[null,null,null,null,null,null,null,null,null,null,null,null,null,null,null,null,null,null,null,null,null,null,null,null,null,"","","","","","","","","","","","","",""]
[null,null,null,null,null,null,null,null,null,null,null,null,null,null,null,null,null,null,null,null,null,null,null,null,null,"","","","","","","","","","","","","",""]
[null,null,null,null,null,null,null,null,null,null,null,null,null,null,null,null,null,null,null,null,null,null,null,null,null,"","","","","","","","","","","","","",""]
[null,null,null,null,null,null,null,null,null,null,null,null,null,null,null,null,null,null,null,null,null,null,null,null,null,"","","","","","","","","","","","","",""]
[null,"Valeurs de screening BOFAS pour l'air du sol : annexe 8 de la Directive (en mg/Nm3)",null,null,null,null,null,null,null,null,null,null,null,null,null,null,null,null,null,null,null,null,null,null,null,{"$f":"INDEX(Z$62:Z$73,MATCH($C$47,$AN$62:$AN$73,0))","v":95000},{"$f":"INDEX(AA$62:AA$73,MATCH($C$47,$AN$62:$AN$73,0))","v":95000},5000,5000,5000,1050,1050,1050,18.149999999999999,1653,52.5,735,4.1500000000000004,370]
[]
[null,"(1) Ces paramètres sont mesurés au niveau de et lors de la mesure du volume"]
[null,"(2) Liste déroulante"]
[null,null,null,null,null,null,null,null,null,null,null,null,null,null,null,null,null,null,null,null,null,null,null,null,null,"TPH aliphatic EC >5-6","TPH aliphatic EC >6-8","TPH aliphatic EC >8-10","TPH aliphatic EC >10-12","TPH aliphatic EC >12-16","TPH aromatic EC >8-10","TPH aromatic EC >10-12","TPH aromatic EC >12-16","Benzene","Toluene","Ethyl-benzeen","Xylene","Naphthalene","MTBE","CSM"]
[null,null,null,null,null,null,null,null,null,null,null,null,null,null,null,null,null,null,null,null,null,null,null,null,null,95000,95000,5000,5000,5000,1050,1050,1050,18.149999999999999,1653,52.5,735,4.1500000000000004,370,"A-air1"]
[null,null,"A-air1",null,null,null,null,null,null,null,null,null,null,null,null,null,null,null,null,null,null,null,null,null,null,175000,175000,9500,9500,9500,1950,1950,1950,34.299999999999997,3150,98,1400,7.9,720,"A-air2"]
[null,null,"A-air2",null,null,null,null,null,null,null,null,null,null,null,null,null,null,null,null,null,null,null,null,null,null,320000,320000,175000,175000,175000,3600,3600,3600,62.5,5900,192,2560,15,1350,"A-air3"]
[null,null,"A-air3",null,null,null,null,null,null,null,null,null,null,null,null,null,null,null,null,null,null,null,null,null,null,4100000,4100000,225000,225000,225000,44000,44000,44000,775,72000,2350,32500,182.5,16600,"A-air4"]
[null,null,"A-air4",null,null,null,null,null,null,null,null,null,null,null,null,null,null,null,null,null,null,null,null,null,null,8098000,8098000,450000,450000,450000,88000,88000,88000,1550,142500,4650,64000,365,33250,"A-air5"]
[null,null,"A-air5",null,null,null,null,null,null,null,null,null,null,null,null,null,null,null,null,null,null,null,null,null,null,20250000,20250000,1110000,1110000,1110000,222000,222000,222000,3890,360000,11700,161500,912,79000,"A-air7"]
[null,null,"A-air7",null,null,null,null,null,null,null,null,null,null,null,null,null,null,null,null,null,null,null,null,null,null,28000,28000,1400,1400,1400,300,300,300,4.9550000000000001,447,13.7,187.5,1.07,112.5,"Z-air1"]
[null,null,"Z-air1",null,null,null,null,null,null,null,null,null,null,null,null,null,null,null,null,null,null,null,null,null,null,54000,54000,2900,2900,2900,580,580,580,10,920,29.25,410,2.4,222.5,"Z-air2"]
[null,null,"Z-air2",null,null,null,null,null,null,null,null,null,null,null,null,null,null,null,null,null,null,null,null,null,null,89000,89000,4650,4650,4650,935,935,935,16.25,1500,47.5,700,3.85,356,"Z-air3"]
[null,null,"Z-air3",null,null,null,null,null,null,null,null,null,null,null,null,null,null,null,null,null,null,null,null,null,null,393500,393500,23000,23000,23000,4600,4600,4600,68.5,6040,172.5,2320,12.75,1650,"Z-air4"]
[null,null,"Z-air4",null,null,null,null,null,null,null,null,null,null,null,null,null,null,null,null,null,null,null,null,null,null,885000,885000,48000,48000,48000,9700,9700,9700,145,12730,360,4850,26.5,3450,"Z-air5"]
[null,null,"Z-air5",null,null,null,null,null,null,null,null,null,null,null,null,null,null,null,null,null,null,null,null,null,null,2300000,2300000,124000,124000,124000,24750,24750,24750,375,32500,898,12500,69,8900,"Z-air7"]
[null,null,"Z-air7"]
[]
[null,null,null,null,null,null,null,null,null,null,null,null,null,null,null,null,null,null,null,null,null,null,null,null,null,"Valeurs de screening BOFAS pour l'air du sol : annexe 8 de la Directive (en mg/Nm3)"]
[]
[null,null,null,null,null,null,null,null,null,null,null,null,null,null,null,null,null,null,null,null,null,null,null,null,null,"Texture du sol",null,null,"LIMON",null,null,null,null,null,"SABLE"]
[null,null,null,null,null,null,null,null,null,null,null,null,null,null,null,null,null,null,null,null,null,null,null,null,null,"Type de bâtiment",null,null,"basement (cave)",null,null,"slab-on-grade (dalle de sol)",null,null,"basement (cave)",null,null,"slab-on-grade (dalle de sol)"]
[null,null,null,null,null,null,null,null,null,null,null,null,null,null,null,null,null,null,null,null,null,null,null,null,null,"Prof. piézair sous la base du récepteur",null,null,"2 m-bc *","3 m-bc *","5 m-bc *","1 m-ns **","2 m-ns **","5 m-ns **","2 m-bc *","3 m-bc *","5 m-bc *","1 m-ns **","2 m-ns **","5 m-ns **"]
[null,null,null,null,null,null,null,null,null,null,null,null,null,null,null,null,null,null,null,null,null,null,null,null,null,"Modéle Conceptuel du Site (MCS)",null,null,"A-air1","A-air2","A-air3","A-air4","A-air5","A-air7","Z-air1","Z-air2","Z-air3","Z-air4","Z-air5","Z-air7"]
[null,null,null,null,null,null,null,null,null,null,null,null,null,null,null,null,null,null,null,null,null,null,null,null,null,"B",null,null,18.149999999999999,34.299999999999997,62.5,775,1550,3890,4.9550000000000001,10,16.25,68.5,145,375]
[null,null,null,null,null,null,null,null,null,null,null,null,null,null,null,null,null,null,null,null,null,null,null,null,null,"T",null,null,1653,3150,5900,72000,142500,360000,447,920,1500,6040,12730,32500]
[null,null,null,null,null,null,null,null,null,null,null,null,null,null,null,null,null,null,null,null,null,null,null,null,null,"E",null,null,52.5,98,192,2350,4650,11700,13.7,29.25,47.5,172.5,360,898]
[null,null,null,null,null,null,null,null,null,null,null,null,null,null,null,null,null,null,null,null,null,null,null,null,null,"X",null,null,735,1400,2560,32500,64000,161500,187.5,410,700,2320,4850,12500]
[null,null,null,null,null,null,null,null,null,null,null,null,null,null,null,null,null,null,null,null,null,null,null,null,null,"N",null,null,4.1500000000000004,7.9,15,182.5,365,912,1.07,2.4,3.85,12.75,26.5,69]
[null,null,null,null,null,null,null,null,null,null,null,null,null,null,null,null,null,null,null,null,null,null,null,null,null,"MTBE",null,null,370,720,1350,16600,33250,79000,112.5,222.5,356,1650,3450,8900]
[]
[null,null,null,null,null,null,null,null,null,null,null,null,null,null,null,null,null,null,null,null,null,null,null,null,null,"Aliphates"]
[null,null,null,null,null,null,null,null,null,null,null,null,null,null,null,null,null,null,null,null,null,null,null,null,null,"EC 5-6",null,null,95000,175000,320000,4100000,8098000,20250000,28000,54000,89000,393500,885000,2300000]
[null,null,null,null,null,null,null,null,null,null,null,null,null,null,null,null,null,null,null,null,null,null,null,null,null,"EC 6-8",null,null,95000,175000,340000,4100000,8098000,20250000,28000,54000,89000,393500,885000,2300000]
[null,null,null,null,null,null,null,null,null,null,null,null,null,null,null,null,null,null,null,null,null,null,null,null,null,"EC 8-10",null,null,5000,9500,17500,225000,450000,1110000,1400,2900,4650,23000,48000,124000]
[null,null,null,null,null,null,null,null,null,null,null,null,null,null,null,null,null,null,null,null,null,null,null,null,null,"EC 10-12",null,null,5000,9500,17500,225000,450000,1110000,1400,2900,4650,23000,48000,124000]
[null,null,null,null,null,null,null,null,null,null,null,null,null,null,null,null,null,null,null,null,null,null,null,null,null,"EC 12-16",null,null,5000,9500,17500,225000,450000,1110000,1400,2900,4650,23000,48000,124000]
[]
[null,null,null,null,null,null,null,null,null,null,null,null,null,null,null,null,null,null,null,null,null,null,null,null,null,"Aromates"]
[null,null,null,null,null,null,null,null,null,null,null,null,null,null,null,null,null,null,null,null,null,null,null,null,null,"EC 8-10",null,null,1050,1950,3600,44000,88000,222000,300,580,935,4600,9700,24750]
[null,null,null,null,null,null,null,null,null,null,null,null,null,null,null,null,null,null,null,null,null,null,null,null,null,"EC 10-12",null,null,1050,1950,3600,44000,88000,222000,300,580,935,4600,9700,24750]
[null,null,null,null,null,null,null,null,null,null,null,null,null,null,null,null,null,null,null,null,null,null,null,null,null,"EC 12-16",null,null,1050,1950,3600,44000,88000,222000,300,580,935,4600,9700,24750]
[]
[null,null,null,null,null,null,null,null,null,null,null,null,null,null,null,null,null,null,null,null,null,null,null,null,null,"Source : annexe 8 de la Directive BOFAS"]
[null,null,null,null,null,null,null,null,null,null,null,null,null,null,null,null,null,null,null,null,null,null,null,null,null,"* : distance entre le piézair et la base de la cave (basement)"]
[null,null,null,null,null,null,null,null,null,null,null,null,null,null,null,null,null,null,null,null,null,null,null,null,null,"** : distance entre le piézair et la base du bâtiment (slab-on-grade)"]

{"sheet":"Sol Forages Contrôle IS","index":12,"n_rows":141,"n_cols":108,"rows_kept":141,"cut":false,"hidden":false,"merged":[[29,7,29,9],[27,5,27,6],[28,5,28,6],[29,5,29,6],[32,7,32,9],[27,1,27,4],[28,1,28,4],[29,1,29,4],[30,1,30,4],[31,1,31,4],[32,1,32,4],[30,5,30,6],[31,5,31,6],[32,5,32,6],[30,7,30,9],[27,7,27,9],[28,7,28,9],[32,10,32,14],[25,15,25,16],[26,15,26,16],[27,15,27,16],[28,15,28,16],[29,15,29,16],[30,15,30,16],[31,15,31,16],[31,10,31,14],[26,10,26,14],[27,10,27,14],[28,10,28,14],[29,10,29,14],[30,10,30,14],[32,15,32,16],[5,87,5,100],[5,62,5,63],[5,66,5,71],[5,55,5,60],[5,17,5,18],[5,19,5,24],[5,25,5,38],[5,72,5,85],[26,1,26,4],[4,15,5,15],[4,16,5,16],[5,64,5,65],[5,41,5,54],[25,10,25,14],[7,1,7,16],[18,1,18,16],[21,1,21,16],[4,1,5,9],[4,10,5,14],[25,7,25,9],[26,7,26,9],[25,5,25,6],[26,5,26,6],[1,1,1,107],[2,2,2,107],[3,19,3,107],[4,17,4,60],[4,62,4,63],[4,64,4,107],[3,17,3,18],[3,10,3,14],[3,6,3,8],[3,15,3,16]]}
[]
[null,"Perceptions de chantier et comparaison des résultats d'analyse (DS) pour la partie fixe du sol après les travaux d'assainissement In Situ"]
[null,"Projet:",{"$f":"'Manuel d''utilisation'!C3","v":"BOF_SL_6000: Rue de la Station, 666 à 4308 Manage"}]
[null,"Type usage DS",{"$f":"K26","v":"V"},null,null,null,"Teneur en matière organique (%)",null,null,{"$f":"'Manuel d''utilisation'!C10","v":3},null,null,null,null,null,"Teneur en argile (%)",null,{"$f":"'Manuel d''utilisation'!C11","v":7},null,{"$f":"'Manuel d''utilisation'!AU11","v":0}]
[null,"Identification du forage",null,null,null,null,null,null,null,null,"Caractéristiques organoleptiques",null,null,null,null,"Echantillon","MS","Résultats d'analyse en mg/kg ms",null,null,null,null,null,null,null,null,null,null,null,null,null,null,null,null,null,null,null,null,null,null,null,null,null,null,null,null,null,null,null,null,null,null,null,null,null,null,null,null,null,null,null,null,"Impact gravier",null,"Résultats d'analyse en mg/kg ms après réévaluation sur base du facteur correctif (gravier)"]
[null,null,null,null,null,null,null,null,null,null,null,null,null,null,null,null,null,"HM somme",null,"Hydrocarbures pétroliers\n(fractions globales/combinées)",null,null,null,null,null,"Hydrocarbures pétroliers\n(analyse 'split' aliphatique/aromatique)",null,null,null,null,null,null,null,null,null,null,null,null,null,null,null,"Hydrocarbures pétroliers\ncalculés sur base de la répartition standard diesel",null,null,null,null,null,null,null,null,null,null,null,null,null,"Hydrocarbures aromatiques non halogénés",null,null,null,null,null,null,"Facteur correctif",null,"HM\nsomme",null,"Hydrocarbures pétroliers\n(fractions globales/combinées)",null,null,null,null,null,"Hydrocarbures pétroliers\n(analyse 'split' aliphatique/aromatique)",null,null,null,null,null,null,null,null,null,null,null,null,null,null,"Hydrocarbures pétroliers\ncalculés sur base de la répartition standard diesel",null,null,null,null,null,null,null,null,null,null,null,null,null,null,null,"Hydrocarbures aromatiques non halogénés"]
[null,"Parcelle cadastrale","Code du forage","X (Lambert)","Y (Lambert)","Refus de forage(6)","Date du forage","Phase d'étude(6)","Terrain naturel (TN) / Remblai (R)(6)","Profondeur du forage \n(cm-ns)","Profondeur: de (cm-ns) \nà (cm-ns)","Caractérisation(1) (6)","Odeur/PID(2)","Couleur suspecte(6)","Test huile/eau(2)","Profondeur \nde l'échantillon (cm-ns)","Matière sèche (%)","Huile minérale \nEC 5-35","Huile minérale \nEC 10-40","Fraction\nEC 5-8","Fraction\nEC 8-10","Fraction\nEC 10-12","Fraction\nEC 12-16","Fraction\nEC 16-21","Fraction\nEC 21-35","Ali\nEC 5-6","Ali\nEC 6-8","Ali\nEC 8-10","Ali\nEC 10-12","Ali\nEC 12-16","Ali\nEC 16-21","Ali\nEC 21-35","Aro\nEC 6-7","Aro\nEC 7-8","Aro\nEC 8-10","Aro\nEC 10-12","Aro\nEC 12-16","Aro\nEC 16-21","Aro\nEC 21-35",null,"Nature TPH(7) (6)","Ali\nEC 5-6","Ali\nEC 6-8","Ali\nEC 8-10","Ali\nEC 10-12","Ali\nEC 12-16","Ali\nEC 16-21","Ali\nEC 21-35","Aro\nEC 6-7","Aro\nEC 7-8","Aro\nEC 8-10","Aro\nEC 10-12","Aro\nEC 12-16","Aro\nEC 16-21","Aro\nEC 21-35","Benzène","Toluène","Ethylbenzène","Xylènes (somme)","MTBE","Naphtalène",null,"Pourcentage de cailloux","Pourcentage de fractions fines","Huile minérale \nEC 5-35","Huile minérale \nEC 10-40","Fraction\nEC 5-8","Fraction\nEC 8-10","Fraction\nEC 10-12","Fraction\nEC 12-16","Fraction\nEC 16-21","Fraction\nEC 21-35","Ali\nEC 5-6","Ali\nEC 6-8","Ali\nEC 8-10","Ali\nEC 10-12","Ali\nEC 12-16","Ali\nEC 16-21","Ali\nEC 21-35","Aro\nEC 6-7","Aro\nEC 7-8","Aro\nEC 8-10","Aro\nEC 10-12","Aro\nEC 12-16","Aro\nEC 16-21","Aro\nEC 21-35",null,"Ali\nEC 5-6","Ali\nEC 6-8","Ali\nEC 8-10","Ali\nEC 10-12","Ali\nEC 12-16","Ali\nEC 16-21","Ali\nEC 21-35","Aro\nEC 6-7","Aro\nEC 7-8","Aro\nEC 8-10","Aro\nEC 10-12","Aro\nEC 12-16","Aro\nEC 16-21","Aro\nEC 21-35",null,"Benzène","Toluène","Ethylbenzène","Xylènes (somme)","MTBE","Naphtalène"]
[null,"Zone suspecte investiguée:"]
[null,"1076Z","C1",null,null,null,"28/12/2004","EO","R",420,"150-200","DI","*","oui",null,"370-400",null,100,100,"<12",22,120,800,10000,7,"<12.5",100,1000,null,null,null,null,null,null,null,null,null,null,null,null,"DI",null,{"$f":"IF(($AO9<>\"DI\"),\"np\",IF($R9<>\"\",IFERROR(0.00098*($R9),\"<\"),IF($S9<>\"\",IFERROR(0.001002*($S9),\"<\"),\"\")))","v":9.8000000000000004E-2},{"$f":"IF(($AO9<>\"DI\"),\"np\",IF($R9<>\"\",IFERROR(0.00879*($R9),\"<\"),IF($S9<>\"\",IFERROR(0.00901804*($S9),\"<\"),\"\")))","v":0.87899999999999989},{"$f":"IF(($AO9<>\"DI\"),\"np\",IF($R9<>\"\",IFERROR(0.08203*($R9),\"<\"),IF($S9<>\"\",IFERROR(0.08416834*($S9),\"<\"),\"\")))","v":8.2030000000000012},{"$f":"IF(($AO9<>\"DI\"),\"np\",IF($R9<>\"\",IFERROR(0.47363*($R9),\"<\"),IF($S9<>\"\",IFERROR(0.4859719*($S9),\"<\"),\"\")))","v":47.363},{"$f":"IF(($AO9<>\"DI\"),\"np\",IF($R9<>\"\",IFERROR(0.22461*($R9),\"<\"),IF($S9<>\"\",IFERROR(0.2304609*($S9),\"<\"),\"\")))","v":22.461000000000002},null,null,null,{"$f":"IF(($AO9<>\"DI\"),\"np\",IF($R9<>\"\",IFERROR(0.01563*($R9),\"<\"),IF($S9<>\"\",IFERROR(0.01603206*($S9),\"<\"),\"\")))","v":1.5630000000000002},{"$f":"IF(($AO9<>\"DI\"),\"np\",IF($R9<>\"\",IFERROR(0.01367*($R9),\"<\"),IF($S9<>\"\",IFERROR(0.01402806*($S9),\"<\"),\"\")))","v":1.367},{"$f":"IF(($AO9<>\"DI\"),\"np\",IF($R9<>\"\",IFERROR(0.1123*($R9),\"<\"),IF($S9<>\"\",IFERROR(0.1152305*($S9),\"<\"),\"\")))","v":11.23},{"$f":"IF(($AO9<>\"DI\"),\"np\",IF($R9<>\"\",IFERROR(0.06836*($R9),\"<\"),IF($S9<>\"\",IFERROR(0.07014028*($S9),\"<\"),\"\")))","v":6.8360000000000003},null,"<",7,1,0.01,0.01,2.5499999999999998,null,null,0.2,{"$f":"IFERROR($BL9*R9,\"<\")","v":20},20,"<",4.4000000000000004,24,160,2000,1.4000000000000001,"<",20,200,0,0,0,0,0,{"$f":"IFERROR($BL9*AH9,\"<\")","v":0},0,0,0,0,0,null,{"$f":"IFERROR($BL9*AP9,\"<\")","v":0},{"$f":"IF(($AO9=\"DI\"),IFERROR($BL9*AQ9,\"<\"),\"np\")","v":1.9600000000000003E-2},0.17579999999999998,1.6406000000000003,9.4725999999999999,4.4922000000000004,{"$f":"$BL9*AV9","v":0},0,0,{"$f":"IF(($AO9=\"DI\"),IFERROR($BL9*AY9,\"<\"),\"np\")","v":0.31260000000000004},0.27340000000000003,2.246,1.3672000000000002,{"$f":"$BL9*BC9","v":0},null,{"$f":"IFERROR($BL9*BD9,\"<\")","v":"<"},1.4000000000000001,0.2,2E-3,2E-3,0.51]
[null,null,null,null,null,null,null,null,null,null,null,null,null,null,null,null,null,null,null,null,null,null,null,null,null,null,null,null,null,null,null,null,null,null,null,null,null,null,null,null,"autre ou ?",null,{"$f":"IF(($AO10<>\"DI\"),\"np\",IF($R10<>\"\",IFERROR(0.00098*($R10),\"<\"),IF($S10<>\"\",IFERROR(0.001002*($S10),\"<\"),\"\")))","v":"np"},{"$f":"IF(($AO10<>\"DI\"),\"np\",IF($R10<>\"\",IFERROR(0.00879*($R10),\"<\"),IF($S10<>\"\",IFERROR(0.00901804*($S10),\"<\"),\"\")))","v":"np"},{"$f":"IF(($AO10<>\"DI\"),\"np\",IF($R10<>\"\",IFERROR(0.08203*($R10),\"<\"),IF($S10<>\"\",IFERROR(0.08416834*($S10),\"<\"),\"\")))","v":"np"},{"$f":"IF(($AO10<>\"DI\"),\"np\",IF($R10<>\"\",IFERROR(0.47363*($R10),\"<\"),IF($S10<>\"\",IFERROR(0.4859719*($S10),\"<\"),\"\")))","v":"np"},{"$f":"IF(($AO10<>\"DI\"),\"np\",IF($R10<>\"\",IFERROR(0.22461*($R10),\"<\"),IF($S10<>\"\",IFERROR(0.2304609*($S10),\"<\"),\"\")))","v":"np"},null,null,null,{"$f":"IF(($AO10<>\"DI\"),\"np\",IF($R10<>\"\",IFERROR(0.01563*($R10),\"<\"),IF($S10<>\"\",IFERROR(0.01603206*($S10),\"<\"),\"\")))","v":"np"},{"$f":"IF(($AO10<>\"DI\"),\"np\",IF($R10<>\"\",IFERROR(0.01367*($R10),\"<\"),IF($S10<>\"\",IFERROR(0.01402806*($S10),\"<\"),\"\")))","v":"np"},{"$f":"IF(($AO10<>\"DI\"),\"np\",IF($R10<>\"\",IFERROR(0.1123*($R10),\"<\"),IF($S10<>\"\",IFERROR(0.1152305*($S10),\"<\"),\"\")))","v":"np"},{"$f":"IF(($AO10<>\"DI\"),\"np\",IF($R10<>\"\",IFERROR(0.06836*($R10),\"<\"),IF($S10<>\"\",IFERROR(0.07014028*($S10),\"<\"),\"\")))","v":"np"},null,null,null,null,null,null,null,null,null,0.2,0,0,0,0,0,0,0,0,0,0,0,0,0,0,0,0,0,0,0,0,0,0,null,0,"np","np","np","np","np",0,0,0,"np","np","np","np",0,null,0,0,0,0,0,0]
[null,null,null,null,null,null,null,null,null,null,null,null,null,null,null,null,null,null,null,null,null,null,null,null,null,null,null,null,null,null,null,null,null,null,null,null,null,null,null,null,"autre ou ?",null,"np","np","np","np","np",null,null,null,"np","np","np","np",null,null,null,null,null,null,null,null,null,0.2,0,0,0,0,0,0,0,0,0,0,0,0,0,0,0,0,0,0,0,0,0,0,null,0,"np","np","np","np","np",0,0,0,"np","np","np","np",0,null,0,0,0,0,0,0]
[null,null,null,null,null,null,null,null,null,null,null,null,null,null,null,null,null,null,null,null,null,null,null,null,null,null,null,null,null,null,null,null,null,null,null,null,null,null,null,null,"autre ou ?",null,"np","np","np","np","np",null,null,null,"np","np","np","np",null,null,null,null,null,null,null,null,null,0.2,0,0,0,0,0,0,0,0,0,0,0,0,0,0,0,0,0,0,0,0,0,0,null,0,"np","np","np","np","np",0,0,0,"np","np","np","np",0,null,0,0,0,0,0,0]
[null,null,null,null,null,null,null,null,null,null,null,null,null,null,null,null,null,null,null,null,null,null,null,null,null,null,null,null,null,null,null,null,null,null,null,null,null,null,null,null,"DI",null,"","","","","",null,null,null,"","","","",null,null,null,null,null,null,null,null,null,0.2,0,0,0,0,0,0,0,0,0,0,0,0,0,0,0,0,0,0,0,0,0,0,null,0,"<","<","<","<","<",0,0,0,"<","<","<","<",0,null,0,0,0,0,0,0]
[null,null,null,null,null,null,null,null,null,null,null,null,null,null,null,null,null,null,null,null,null,null,null,null,null,null,null,null,null,null,null,null,null,null,null,null,null,null,null,null,"DI",null,"","","","","",null,null,null,"","","","",null,null,null,null,null,null,null,null,null,0.2,0,0,0,0,0,0,0,0,0,0,0,0,0,0,0,0,0,0,0,0,0,0,null,0,"<","<","<","<","<",0,0,0,"<","<","<","<",0,null,0,0,0,0,0,0]
[null,null,null,null,null,null,null,null,null,null,null,null,null,null,null,null,null,null,null,null,null,null,null,null,null,null,null,null,null,null,null,null,null,null,null,null,null,null,null,null,"DI",null,"","","","","",null,null,null,"","","","",null,null,null,null,null,null,null,null,null,0.2,0,0,0,0,0,0,0,0,0,0,0,0,0,0,0,0,0,0,0,0,0,0,null,0,"<","<","<","<","<",0,0,0,"<","<","<","<",0,null,0,0,0,0,0,0]
[null,null,null,null,null,null,null,null,null,null,null,null,null,null,null,null,null,null,null,null,null,null,null,null,null,null,null,null,null,null,null,null,null,null,null,null,null,null,null,null,"autre ou ?",null,"np","np","np","np","np",null,null,null,"np","np","np","np",null,null,null,null,null,null,null,null,null,0.2,0,0,0,0,0,0,0,0,0,0,0,0,0,0,0,0,0,0,0,0,0,0,null,0,"np","np","np","np","np",0,0,0,"np","np","np","np",0,null,0,0,0,0,0,0]
[null,null,null,null,null,null,null,null,null,null,null,null,null,null,null,null,null,null,null,null,null,null,null,null,null,null,null,null,null,null,null,null,null,null,null,null,null,null,null,null,"DI",null,"","","","","",null,null,null,"","","","",null,null,null,null,null,null,null,null,null,0.2,0,0,0,0,0,0,0,0,0,0,0,0,0,0,0,0,0,0,0,0,0,0,null,0,"<","<","<","<","<",0,0,0,"<","<","<","<",0,null,0,0,0,0,0,0]
[null,null,null,null,null,null,null,null,null,null,null,null,null,null,null,null,null,null,null,null,null,null,null,null,null,null,null,null,null,null,null,null,null,null,null,null,null,null,null,null,null,null,"np","np","np","np","np",null,null,null,"np","np","np","np",null,null,null,null,null,null,null,null,null,0.2,0,0,0,0,0,0,0,0,0,0,0,0,0,0,0,0,0,0,0,0,0,0,null,0,"np","np","np","np","np",0,0,0,"np","np","np","np",0,null,0,0,0,0,0,0]
[null,"Autre zone suspecte:"]
[null,null,null,null,null,null,null,null,null,null,null,null,null,null,null,null,null,null,null,null,null,null,null,null,null,null,null,null,null,null,null,null,null,null,null,null,null,null,null,null,"autre ou ?",null,"np","np","np","np","np",null,null,null,"np","np","np","np",null,null,null,null,null,null,null,null,null,0.5,{"$f":"IFERROR($BL20*R20,\"<\")","v":0},{"$f":"IFERROR($BL20*S20,\"<\")","v":0},{"$f":"IFERROR($BL20*T20,\"<\")","v":0},{"$f":"IFERROR($BL20*U20,\"<\")","v":0},{"$f":"IFERROR($BL20*V20,\"<\")","v":0},{"$f":"IFERROR($BL20*W20,\"<\")","v":0},{"$f":"IFERROR($BL20*X20,\"<\")","v":0},{"$f":"IFERROR($BL20*Y20,\"<\")","v":0},{"$f":"IFERROR($BL20*Z20,\"<\")","v":0},{"$f":"IFERROR($BL20*AA20,\"<\")","v":0},{"$f":"IFERROR($BL20*AB20,\"<\")","v":0},{"$f":"IFERROR($BL20*AC20,\"<\")","v":0},{"$f":"IFERROR($BL20*AD20,\"<\")","v":0},{"$f":"IFERROR($BL20*AE20,\"<\")","v":0},{"$f":"IFERROR($BL20*AF20,\"<\")","v":0},{"$f":"IFERROR($BL20*AG20,\"<\")","v":0},{"$f":"IFERROR($BL20*AH20,\"<\")","v":0},{"$f":"IFERROR($BL20*AI20,\"<\")","v":0},{"$f":"IFERROR($BL20*AJ20,\"<\")","v":0},{"$f":"IFERROR($BL20*AK20,\"<\")","v":0},{"$f":"IFERROR($BL20*AL20,\"<\")","v":0},{"$f":"IFERROR($BL20*AM20,\"<\")","v":0},null,{"$f":"IFERROR($BL20*AP20,\"<\")","v":0},{"$f":"IF(($AO20=\"DI\"),IFERROR($BL20*AQ20,\"<\"),\"np\")","v":"np"},"np","np","np","np",{"$f":"$BL20*AV20","v":0},0,0,{"$f":"IF(($AO20=\"DI\"),IFERROR($BL20*AY20,\"<\"),\"np\")","v":"np"},"np","np","np",{"$f":"$BL20*BC20","v":0},null,{"$f":"IFERROR($BL20*BD20,\"<\")","v":0},{"$f":"IFERROR($BL20*BE20,\"<\")","v":0},{"$f":"IFERROR($BL20*BF20,\"<\")","v":0},{"$f":"IFERROR($BL20*BG20,\"<\")","v":0},{"$f":"IFERROR($BL20*BH20,\"<\")","v":0},{"$f":"IFERROR($BL20*BI20,\"<\")","v":0}]
[null,null,null,null,null,null,null,null,null,null,null,null,null,null,null,null,null,null,null,null,null,null,null,null,null,null,null,null,null,null,null,null,null,null,null,null,null,null,null,null,"autre ou ?",null,"np","np","np","np","np",null,null,null,"np","np","np","np",null,null,null,null,null,null,null,null,null,0.5,{"$f":"IFERROR($BL21*R21,\"<\")","v":0},0,0,0,0,0,0,0,0,0,0,0,0,0,0,0,0,0,0,0,0,0,null,{"$f":"IFERROR($BL21*AP21,\"<\")","v":0},"np","np","np","np","np",0,0,0,"np","np","np","np",{"$f":"$BL21*BC21","v":0},null,{"$f":"IFERROR($BL21*BD21,\"<\")","v":0},0,0,0,0,0]
[null,"Autre zone suspecte:"]
[null,null,null,null,null,null,null,null,null,null,null,null,null,null,null,null,null,null,null,null,null,null,null,null,null,null,null,null,null,null,null,null,null,null,null,null,null,null,null,null,null,null,"np","np","np","np","np",null,null,null,"np","np","np","np",null,null,null,null,null,null,null,null,null,0.5,{"$f":"IFERROR($BL23*R23,\"<\")","v":0},{"$f":"IFERROR($BL23*S23,\"<\")","v":0},{"$f":"IFERROR($BL23*T23,\"<\")","v":0},{"$f":"IFERROR($BL23*U23,\"<\")","v":0},{"$f":"IFERROR($BL23*V23,\"<\")","v":0},{"$f":"IFERROR($BL23*W23,\"<\")","v":0},{"$f":"IFERROR($BL23*X23,\"<\")","v":0},null,{"$f":"IFERROR($BL23*Z23,\"<\")","v":0},{"$f":"IFERROR($BL23*AA23,\"<\")","v":0},{"$f":"IFERROR($BL23*AB23,\"<\")","v":0},{"$f":"IFERROR($BL23*AC23,\"<\")","v":0},{"$f":"IFERROR($BL23*AD23,\"<\")","v":0},{"$f":"IFERROR($BL23*AE23,\"<\")","v":0},{"$f":"IFERROR($BL23*AF23,\"<\")","v":0},{"$f":"IFERROR($BL23*AG23,\"<\")","v":0},{"$f":"IFERROR($BL23*AH23,\"<\")","v":0},{"$f":"IFERROR($BL23*AI23,\"<\")","v":0},{"$f":"IFERROR($BL23*AJ23,\"<\")","v":0},{"$f":"IFERROR($BL23*AK23,\"<\")","v":0},{"$f":"IFERROR($BL23*AL23,\"<\")","v":0},{"$f":"IFERROR($BL23*AM23,\"<\")","v":0},null,{"$f":"IFERROR($BL23*AP23,\"<\")","v":0},{"$f":"IF(($AO23=\"DI\"),IFERROR($BL23*AQ23,\"<\"),\"np\")","v":"np"},"np","np","np","np",{"$f":"$BL23*AV23","v":0},0,0,{"$f":"IF(($AO23=\"DI\"),IFERROR($BL23*AY23,\"<\"),\"np\")","v":"np"},"np","np","np",{"$f":"$BL23*BC23","v":0},null,{"$f":"IFERROR($BL23*BD23,\"<\")","v":0},{"$f":"IFERROR($BL23*BE23,\"<\")","v":0},{"$f":"IFERROR($BL23*BF23,\"<\")","v":0},{"$f":"IFERROR($BL23*BG23,\"<\")","v":0},{"$f":"IFERROR($BL23*BH23,\"<\")","v":0},{"$f":"IFERROR($BL23*BI23,\"<\")","v":0}]
[null,null,null,null,null,null,null,null,null,null,null,null,null,null,null,null,null,null,null,null,null,null,null,null,null,null,null,null,null,null,null,null,null,null,null,null,null,null,null,null,null,null,"np","np","np","np","np",null,null,null,"np","np","np","np",null,null,null,null,null,null,null,null,null,0.5,{"$f":"IFERROR($BL24*R24,\"<\")","v":0},0,0,0,0,0,0,null,{"$f":"IFERROR($BL24*Z24,\"<\")","v":0},0,0,0,0,0,0,0,0,0,0,0,0,0,null,{"$f":"IFERROR($BL24*AP24,\"<\")","v":0},"np","np","np","np","np",0,0,0,"np","np","np","np",{"$f":"$BL24*BC24","v":0},null,{"$f":"IFERROR($BL24*BD24,\"<\")","v":0},0,0,0,0,0]
[null,"Légende",null,null,null,null,null,null,null,null,null,null,null,null,null,null,null,null,null,null,null,null,null,null,null,null,null,null,null,null,null,null,null,null,null,null,null,null,null,null,null,null,null,null,null,null,null,null,null,null,null,null,null,null,null,null,null,null,null,null,null,null,null,null,null,null,null,null,null,null,null,null,null,null,null,null,null,null,null,null,null,null,null,null,null,null,null,null,null,null,null,null,null,null,null,null,null,null,null,null,null,null,{"$f":"$BL25*BD25","v":0},0,0,0,0,0]
[null,"Caractère gras et rouge= excède la  ",null,null,null,null,null,"usage DS(6)",null,null,"V",null,null,null,null,"VS(3)",null,{"$f":"INDEX(R$54:R$58,MATCH($K$26,$P$54:$P$58,0))","v":"-"},"-",9,600,600,920,2700,5300,"-","-","-","-","-","-","-","-","-","-","-","-","-","-",null,null,{"$f":"INDEX(AP$54:AP$58,MATCH($K$26,$P$54:$P$58,0))","v":"-"},"-","-","-","-","-","-","-","-","-","-","-","-","-",0.2,22,3,30,2,6.3,null,null,null,{"$f":"R26","v":"-"},"-",9,600,600,920,2700,5300,"-","-","-","-","-","-","-","-","-","-","-","-","-","-",null,{"$f":"AP26","v":"-"},"-","-","-","-","-","-","-","-","-","-","-","-","-",null,{"$f":"BD26","v":0.2},22,3,30,2,6.3]
[null,"Caractère Souligné = excède la  ",null,null,null,null,null,"usage DS(6)",null,null,"IV",null,null,null,null,"VSH(3)",null,{"$f":"INDEX(R$63:R$67,MATCH($K$27,$P$63:$P$67,0))","v":"-"},"-",6,1330.42,34559.43,34592.86,48464.75,48464.75,411.7,"-",50010,50150,50170,"-","-",0.7,125,406.7,20030,20060,15050,15050,null,null,{"$f":"Z27","v":411.7},"-",50010,50150,50170,"-","-",0.7,125,406.7,20030,20060,15050,15050,{"$f":"INDEX(BD$63:BD$67,MATCH($K$27,$P$63:$P$67,0))","v":0.7},125,3.21,74.94,43.48,29.56,null,null,null,null,null,6,1330.42,34559.43,34592.86,48464.75,48464.75,411.7,"-",50010,50150,50170,"-","-",0.7,125,406.7,20030,20060,15050,15050,null,{"$f":"BU27","v":411.7},"-",50010,50150,50170,"-","-",0.7,125,406.7,20030,20060,15050,15050,null,0.7,125,3.21,74.94,43.48,29.56]
[null,null,null,null,null,null,null,"usage DS(6)",null,null,"III",null,null,null,null,"VSN(3)",null,{"$f":"INDEX(R$127:R$131,MATCH($K$28,$P$127:$P$131,0))","v":0},0,6,149,577,5393,302208,1000000,0,0,0,0,0,0,0,0,0,0,0,0,0,0,null,null,{"$f":"INDEX(AP$127:AP$131,MATCH($K$28,$P$127:$P$131,0))","v":0},0,0,0,0,0,0,0,0,0,0,0,0,0,0.2,7.1,6,7.9,1.5,2.5,null,null,null,null,null,6,149,577,5393,302208,1000000,0,0,0,0,0,0,0,0,0,0,0,0,0,0,null,0,0,0,0,0,0,0,0,0,0,0,0,0,0,null,0.2,7.1,6,7.9,1.5,2.5]
[null,null,null,null,null,null,null,null,null,null,null,null,null,null,null,"VSN-aj(3) (5)",null,null,null,null,null,null,null,null,null,null,null,null,null,null,null,null,null,null,null,null,null,null,null,null,null,{"$f":"Z29","v":0},0,0,0,0,0,0,0,0,0,0,0,0,0,null,null,null,null,null,null,null,null,null,null,null,0,0,0,0,0,0,0,0,0,0,0,0,0,0,0,0,0,0,0,0,null,0,0,0,0,0,0,0,0,0,0,0,0,0,0,null,0,0,0,0,0,0]
[null,null,null,null,null,null,null,"usage DS(6)",null,null,"III",null,null,null,null,"VLN(3)",null,{"$f":"INDEX(R$137:R$141,MATCH($K$30,$P$137:$P$141,0))","v":0},0,12,298,1154,10786,604416,1000000,0,0,0,0,0,0,0,0,0,0,0,0,0,0,null,null,{"$f":"INDEX(AP$137:AP$141,MATCH($K$30,$P$137:$P$141,0))","v":0},0,0,0,0,0,0,0,0,0,0,0,0,0,1,59,30,34,6.18,17,null,null,null,null,null,12,298,1154,10786,604416,1000000,0,0,0,0,0,0,0,0,0,0,0,0,0,0,null,0,0,0,0,0,0,0,0,0,0,0,0,0,0,null,1,59,30,34,6.18,17]
[null,null,null,null,null,null,null,null,null,null,null,null,null,null,null,"VLN-aj(3) (5)",null,null,null,null,null,null,null,null,null,null,null,null,null,null,null,null,null,null,null,null,null,null,null,null,null,{"$f":"Z31","v":0},0,0,0,0,0,0,0,0,0,0,0,0,0,null,null,null,null,null,null,null,null,null,null,null,0,0,0,0,0,0,0,0,0,0,0,0,0,0,0,0,0,0,0,0,null,0,0,0,0,0,0,0,0,0,0,0,0,0,0,null,0,0,0,0,0,0]
[null,"Fond jaune = excède le",null,null,null,null,null,null,null,"MCS applicable(6)","LIMON MCS-1",null,null,null,null,"BOF-SRA(3)",null,{"$f":"INDEX(R$87:R$121,MATCH($K$32,$P$87:$P$121,0))","v":4000},{"$f":"INDEX(S$87:S$121,MATCH($K$32,$P$87:$P$121,0))","v":3900},null,{"$f":"INDEX(U$87:U$121,MATCH($K$32,$P$87:$P$121,0))","v":100},{"$f":"INDEX(V$87:V$121,MATCH($K$32,$P$87:$P$121,0))","v":390},null,null,null,{"$f":"INDEX(Z$87:Z$121,MATCH($K$32,$P$87:$P$121,0))","v":"-"},4,36,336,1940,920,"-","-","-",64,56,460,280,"-",null,null,"-",4,36,336,1940,920,"-","-","-",64,56,460,280,"-",{"$f":"INDEX(BD$87:BD$121,MATCH($K$32,$P$87:$P$121,0))","v":0.16200000000000001},19,0.7,11.1,10,6,null,null,null,{"$f":"R32","v":4000},{"$f":"S32","v":3900},0,100,390,0,0,0,"-",4,36,336,1940,920,"-","-","-",64,56,460,280,"-",null,"-",4,36,336,1940,920,"-","-","-",64,56,460,280,"-",null,0.16200000000000001,19,0.7,11.1,10,6]
[null,null,null,null,null,null,null,"usage (DS)(4) (6)",null,null,"III",null,null,null,null,"VSE(3)",null,{"$f":"INDEX(R$77:R$79,MATCH($K$33,$P$77:$P$79,0))","v":"-"},"-",105,105,75,75,650,650,"-","-","-","-","-","-","-","-","-","-","-","-","-","-",null,null,{"$f":"INDEX(AP$77:AP$79,MATCH($K$33,$P$77:$P$79,0))","v":"-"},"-","-","-","-","-","-","-","-","-","-","-","-","-",14,8.5,12,2,8,7.2,null,null,null,null,null,105,105,75,75,650,650,"-","-","-","-","-","-","-","-","-","-","-","-","-","-",null,"-","-","-","-","-","-","-","-","-","-","-","-","-","-",null,14,8.5,12,2,8,7.2]
[]
[]
[null,"(1) ESS = essence; DI = diesel; HA = hydrocarbures aromatiques ; MC = mazout de chauffage ; AU = autre"]
[null,"(2) Blanc (vide) = néant ; * = léger ; ** = moyen ; *** = fort ou valeur PID mesurée - il n'est pas nécessaire d'indiquer en même temps les perceptions organoleptiques et la réaction huile/eau qui n'est pas strictement nécessaire"]
[null,"(3) A adapter conformément à la législation et aux paramètres spécifiques au site"]
[null,"(4) Voir le GRER (partie D) pour l'applicabilité et les dérogations"]
[null,"(5) A calculer selon le GRER (partie C - annexe C2)"]
[null,"(6) Liste déroulante"]
[null,"(7) Dans le cas de diesel (\"DI\"), il convient de procéder à l'évaluation (vis-a-vis des VSH ou du BOF_SRA) sur base de la \"répartition standard diesel\" ; dans les autres cas (polluant autre que \"DI\"), il n'y a pas lieu de procéder à cette évaluation"]
[null,null,null,null,null,null,null,null,null,null,null,null,null,null,null,null,null,null,null,null,null,null,null,null,null,null,null,null,null,null,null,null,null,null,null,null,null,null,null,null,"DI"]
[null,null,null,null,null,null,null,"EO","TN",null,null,"Ess",null,"oui",null,null,null,null,null,null,null,null,null,null,null,null,null,null,null,null,null,null,null,null,null,null,null,null,null,null,"autre ou ?"]
[null,null,null,null,null,"Oui",null,"EC","R",null,null,"DI",null,"non"]
[null,null,null,null,null,null,null,"PA","non défini",null,null,"HA"]
[null,null,null,null,null,null,null,"EF",null,null,null,"MC"]
[null,null,null,null,null,null,null,"MON",null,null,null,"AU"]
[null,null,null,null,null,null,null,"EI"]
[null,null,null,null,null,null,null,"autre/non défini"]
[]
[null,null,null,null,null,null,null,null,null,null,null,null,null,null,"VS (DS)","usage",null,"conc. en mg/kg ms"]
[null,null,null,null,null,null,null,null,null,null,null,null,null,null,null,null,null,"Huile minérale \nEC5-35","Huile minérale \nEC10-40","Fraction\nEC 5-8","Fraction\nEC >8-10","Fraction\nEC >10-12","Fraction\nEC >12-16","Fraction\nEC >16-21","Fraction\nEC >21-35","ALI\nEC 5-6","ALI\nEC >6-8","ALI\nEC >8-10","ALI\nEC >10-12","ALI\nEC >12-16","ALI\nEC >16-21","ALI\nEC >21-35","Arom\nEC 6-7","Arom\nEC >7-8","Arom\nEC >8-10","Arom\nEC >10-12","Arom\nEC >12-16","Arom\nEC >16-21","Arom\nEC >21-35",null,null,"ALI\nEC 5-6","ALI\nEC >6-8","ALI\nEC >8-10","ALI\nEC >10-12","ALI\nEC >12-16","ALI\nEC >16-21","ALI\nEC >21-35","Arom\nEC 6-7","Arom\nEC >7-8","Arom\nEC >8-10","Arom\nEC >10-12","Arom\nEC >12-16","Arom\nEC >16-21","Arom\nEC >21-35","Benzène","Toluène","Ethylbenzène","Xylènes (somme)","MTBE","Naphtalène"]
[null,null,null,null,null,null,null,null,null,null,null,null,null,null,null,"I",null,"-","-",6,21,75,75,650,650,"-","-","-","-","-","-","-","-","-","-","-","-","-","-",null,null,{"$f":"Z54","v":"-"},{"$f":"AA54","v":"-"},"-","-","-","-","-","-","-","-","-","-","-","-",0.1,4,0.3,1,1.5,2.5]
[null,null,null,null,null,null,null,null,null,null,null,null,null,null,null,"II",null,"-","-",6,21,75,75,650,650,"-","-","-","-","-","-","-","-","-","-","-","-","-","-",null,null,{"$f":"Z55","v":"-"},"-","-","-","-","-","-","-","-","-","-","-","-","-",0.1,4,0.3,1,1.5,2.5]
[null,null,null,null,null,null,null,null,null,null,null,null,null,null,null,"III",null,"-","-",6,21,75,75,650,650,"-","-","-","-","-","-","-","-","-","-","-","-","-","-",null,null,{"$f":"Z56","v":"-"},"-","-","-","-","-","-","-","-","-","-","-","-","-",0.1,7,0.3,2,1.5,2.5]
[null,null,null,null,null,null,null,null,null,null,null,null,null,null,null,"IV",null,"-","-",6,150,580,750,1250,2100,"-","-","-","-","-","-","-","-","-","-","-","-","-","-",null,null,{"$f":"Z57","v":"-"},"-","-","-","-","-","-","-","-","-","-","-","-","-",0.2,7,3,8,1.5,2.5]
[null,null,null,null,null,null,null,null,null,null,null,null,null,null,null,"V",null,"-","-",9,600,600,920,2700,5300,"-","-","-","-","-","-","-","-","-","-","-","-","-","-",null,null,{"$f":"Z58","v":"-"},"-","-","-","-","-","-","-","-","-","-","-","-","-",0.2,22,3,30,2,6.3]
[]
[]
[null,null,null,null,null,null,null,null,null,null,null,null,null,null,"VSH (GRER04)","usage",null,"conc. en mg/kg ms"]
[null,null,null,null,null,null,null,null,null,null,null,null,null,null,null,null,null,"Huile minérale \nEC5-35","Huile minérale \nEC10-40","Fraction\nEC 5-8","Fraction\nEC >8-10","Fraction\nEC >10-12","Fraction\nEC >12-16","Fraction\nEC >16-21","Fraction\nEC >21-35","ALI\nEC 5-6","ALI\nEC >6-8","ALI\nEC >8-10","ALI\nEC >10-12","ALI\nEC >12-16","ALI\nEC >16-21","ALI\nEC >21-35","Arom\nEC 6-7","Arom\nEC >7-8","Arom\nEC >8-10","Arom\nEC >10-12","Arom\nEC >12-16","Arom\nEC >16-21","Arom\nEC >21-35",null,null,"ALI\nEC 5-6","ALI\nEC >6-8","ALI\nEC >8-10","ALI\nEC >10-12","ALI\nEC >12-16","ALI\nEC >16-21","ALI\nEC >21-35","Arom\nEC 6-7","Arom\nEC >7-8","Arom\nEC >8-10","Arom\nEC >10-12","Arom\nEC >12-16","Arom\nEC >16-21","Arom\nEC >21-35","Benzène","Toluène","Ethylbenzène","Xylènes (somme)","MTBE","Naphtalène"]
[null,null,null,null,null,null,null,null,null,null,null,null,null,null,null,"I",null,"-","-",953.96,38941.65,34559.43,34592.86,48464.75,48464.75,"-","-",50010,50150,50170,"-","-",143.6,50050,25680,20030,20060,15050,15050,null,null,{"$f":"Z63","v":"-"},"-",50010,50150,50170,"-","-",143.6,50050,25680,20030,20060,15050,15050,143.6,50050,1930,125600,7378,278100]
[null,null,null,null,null,null,null,null,null,null,null,null,null,null,null,"II",null,"-","-",6,24,111.69,1002.14,7890.64,5538.72,36.31,90.83,21.78,111.6,8191,178000,9753,0.1,9.16,29.86,111.9,328.8,2443,2758,null,null,36.31,90.83,21.78,111.6,8191,178000,9753,0.1,9.16,29.86,111.9,328.8,2443,2758,0.1,9.16,0.32,6.36,1.51,3.72]
[null,null,null,null,null,null,null,null,null,null,null,null,null,null,null,"III",null,"-","-",6,24.03,116.43,1726.81,8582.4,9369.0300000000007,36.340000000000003,90.87,21.8,111.8,8757,194000,194100,0.1,9.75,31.57,128.9,601,2657,2909,null,null,36.340000000000003,90.87,21.8,111.8,8757,194000,194100,0.1,9.75,31.57,128.9,601,2657,2909,0.1,9.75,0.35,6.45,2.2400000000000002,3.72]
[null,null,null,null,null,null,null,null,null,null,null,null,null,null,null,"IV",null,"-","-",6,1330.42,34559.43,34592.86,48464.75,48464.75,411.7,"-",50010,50150,50170,"-","-",0.7,125,406.7,20030,20060,15050,15050,null,null,411.7,"-",50010,50150,50170,"-","-",0.7,125,406.7,20030,20060,15050,15050,0.7,125,3.21,74.94,43.48,29.56]
[null,null,null,null,null,null,null,null,null,null,null,null,null,null,null,"V",null,"-","-",9,1357.03,199867.7,208645.78,250568.98,250636.97,422.5,"-",195100,300800,304200,"-","-",0.7,126.1,409.1,112100,120400,91160,91190,null,null,422.5,"-",195100,300800,304200,"-","-",0.7,126.1,409.1,112100,120400,91160,91190,0.7,126.1,3.21,76.63,43.48,29.56]
[null,null,null,null,null,null,null,null,null,null,null,null,null,null,null,"CSAT",null,null,null,null,null,null,null,null,null,626.12,341.22,187.83,114.41,50.74,20.98,2.15,2373.06,1066.04,1391.47,841.71,388.02,137.16999999999999,11.05,null,null,626.12,341.22,187.83,114.41,50.74,20.98,2.15,2373.06,1066.04,1391.47,841.71,388.02,137.16999999999999,11.05,2373.06,1066.04,486,544.61,13645.95,597.25]
[]
[null,null,null,null,null,null,null,null,null,null,null,null,null,null,null,null,null,"en gras, les valeurs dépassent la CSAT (conc. À saturation)"]
[null,null,null,null,null,null,null,null,null,null,null,null,null,null,null,null,null,"le tiret \"-\" signifie que les concentrations dépassent le kg de polluant par kg de sol"]
[null,null,null,null,null,null,null,null,null,null,null,null,null,null,null,null,null,"valeurs surlignées en gris = VS (DS) car VSH<VS"]
[]
[]
[null,null,null,null,null,null,null,null,null,null,null,null,null,null,"VSE (GRER04)","usage",null,"conc. en mg/kg ms"]
[null,null,null,null,null,null,null,null,null,null,null,null,null,null,null,null,null,"Huile minérale \nEC5-35","Huile minérale \nEC10-40","Fraction\nEC 5-8","Fraction\nEC >8-10","Fraction\nEC >10-12","Fraction\nEC >12-16","Fraction\nEC >16-21","Fraction\nEC >21-35","ALI\nEC 5-6","ALI\nEC >6-8","ALI\nEC >8-10","ALI\nEC >10-12","ALI\nEC >12-16","ALI\nEC >16-21","ALI\nEC >21-35","Arom\nEC 6-7","Arom\nEC >7-8","Arom\nEC >8-10","Arom\nEC >10-12","Arom\nEC >12-16","Arom\nEC >16-21","Arom\nEC >21-35",null,null,"ALI\nEC 5-6","ALI\nEC >6-8","ALI\nEC >8-10","ALI\nEC >10-12","ALI\nEC >12-16","ALI\nEC >16-21","ALI\nEC >21-35","Arom\nEC 6-7","Arom\nEC >7-8","Arom\nEC >8-10","Arom\nEC >10-12","Arom\nEC >12-16","Arom\nEC >16-21","Arom\nEC >21-35","Benzène","Toluène","Ethylbenzène","Xylènes (somme)","MTBE","Naphtalène"]
[null,null,null,null,null,null,null,null,null,null,null,null,null,null,null,"I",null,"-","-",105,105,75,75,650,650,"-","-","-","-","-","-","-","-","-","-","-","-","-","-",null,null,{"$f":"Z77","v":"-"},{"$f":"AA77","v":"-"},{"$f":"AB77","v":"-"},{"$f":"AC77","v":"-"},{"$f":"AD77","v":"-"},{"$f":"AE77","v":"-"},{"$f":"AF77","v":"-"},{"$f":"AG77","v":"-"},{"$f":"AH77","v":"-"},{"$f":"AI77","v":"-"},{"$f":"AJ77","v":"-"},{"$f":"AK77","v":"-"},{"$f":"AL77","v":"-"},{"$f":"AM77","v":"-"},11,6,7.8,1.9,6.7,3.7]
[null,null,null,null,null,null,null,null,null,null,null,null,null,null,null,"II",null,"-","-",105,105,75,75,650,650,"-","-","-","-","-","-","-","-","-","-","-","-","-","-",null,null,"-","-","-","-","-","-","-","-","-","-","-","-","-","-",6.4,3.6,4.7,1.1000000000000001,4,3.7]
[null,null,null,null,null,null,null,null,null,null,null,null,null,null,null,"III",null,"-","-",105,105,75,75,650,650,"-","-","-","-","-","-","-","-","-","-","-","-","-","-",null,null,"-","-","-","-","-","-","-","-","-","-","-","-","-","-",14,8.5,12,2,8,7.2]
[]
[]
[]
[]
[]
[null,null,null,null,null,null,null,null,null,null,null,null,null,null,"BOF_SRA","MCS"]
[null,null,null,null,null,null,null,null,null,null,null,null,null,null,null,null,null,"Huile minérale \nEC5-35","Huile minérale \nEC10-40","Fraction\nEC 5-8","Fraction\nEC >8-10","Fraction\nEC >10-12","Fraction\nEC >12-16","Fraction\nEC >16-21","Fraction\nEC >21-35","ALI\nEC 5-6","ALI\nEC >6-8","ALI\nEC >8-10","ALI\nEC >10-12","ALI\nEC >12-16","ALI\nEC >16-21","ALI\nEC >21-35","Arom\nEC 6-7","Arom\nEC >7-8","Arom\nEC >8-10","Arom\nEC >10-12","Arom\nEC >12-16","Arom\nEC >16-21","Arom\nEC >21-35",null,null,"ALI\nEC 5-6","ALI\nEC >6-8","ALI\nEC >8-10","ALI\nEC >10-12","ALI\nEC >12-16","ALI\nEC >16-21","ALI\nEC >21-35","Arom\nEC 6-7","Arom\nEC >7-8","Arom\nEC >8-10","Arom\nEC >10-12","Arom\nEC >12-16","Arom\nEC >16-21","Arom\nEC >21-35","Benzène","Toluène","Ethylbenzène","Xylènes (somme)","MTBE","Naphtalène"]
[null,null,null,null,null,null,null,null,null,null,null,null,null,null,null,"LIMON MCS-1",null,4000,3900,"-",100,390,"-","-","-","-",4,36,336,1940,920,"-","-","-",64,56,460,280,"-",null,null,{"$f":"Z87","v":"-"},{"$f":"AA87","v":4},36,336,1940,920,"-","-","-",64,56,460,280,"-",0.16200000000000001,19,0.7,11.1,10,6]
[null,null,null,null,null,null,null,null,null,null,null,null,null,null,null,"LIMON MCS-2",null,7800,7600,"-",190,740,"-","-","-","-",7.625,68.625,640.5,3698.125,1753.75,"-","-","-",122,106.75,876.875,533.75,"-",null,null,{"$f":"Z88","v":"-"},7.625,68.625,640.5,3698.125,1753.75,"-","-","-",122,106.75,876.875,533.75,"-",0.31,36.1,1.33,21.09,19,11.4]
[null,null,null,null,null,null,null,null,null,null,null,null,null,null,null,"LIMON MCS-3",null,2800,2800,"-",70,270,"-","-","-","-",2.8,25.3,236.3,1364,646.9,"-","-","-",45,39.4,323.39999999999998,196.9,"-",null,null,"-",2.8,25.3,236.3,1364,646.9,"-","-","-",45,39.4,323.39999999999998,196.9,"-",0.12,14,0.53500000000000003,8.35,7.5,4.5]
[null,null,null,null,null,null,null,null,null,null,null,null,null,null,null,"LIMON MCS-4",null,20000,19000,"-",490,1900,"-","-","-","-",19.899999999999999,179.3,1673,9662,4582,"-","-","-",318.8,278.89999999999998,2291,1395,"-",null,null,"-",19.899999999999999,179.3,1673,9662,4582,"-","-","-",318.8,278.89999999999998,2291,1395,"-",0.85,10,3.65,57,50,32]
[null,null,null,null,null,null,null,null,null,null,null,null,null,null,null,"LIMON MCS-5",null,20000,19000,"-",490,1900,"-","-","-","-",19.8,178.2,1663,9603,4554,"-","-","-",316.8,277.2,2277,1386,"-",null,null,"-",19.8,178.2,1663,9603,4554,"-","-","-",316.8,277.2,2277,1386,"-",0.81,94.5,3.7,55.5,47,29.5]
[null,null,null,null,null,null,null,null,null,null,null,null,null,null,null,"LIMON MCS-6",null,20000,20000,"-",1000,20000,"-","-","-","-",360,3240,30240,174600,82800,"-","-","-",5760,5040,41400,25200,"-",null,null,"-",360,3240,30240,174600,82800,"-","-","-",5760,5040,41400,25200,"-",14,3000,63,4000,800,540]
[null,null,null,null,null,null,null,null,null,null,null,null,null,null,null,"LIMON MCS-7",null,20000,20000,"-",1000,20000,"-","-","-","-",360,3240,30240,174600,82800,"-","-","-",5760,5040,41400,25200,"-",null,null,"-",360,3240,30240,174600,82800,"-","-","-",5760,5040,41400,25200,"-",7,840,32,475,440,260]
[null,null,null,null,null,null,null,null,null,null,null,null,null,null,null,"LIMON SABLEUX MCS-1",null,3200,3100,"-",80,310,"-","-","-","-",3.2,28.7,267.8,1546,733.1,"-","-","-",51,44.6,366.6,223.1,"-",null,null,"-",3.2,28.7,267.8,1546,733.1,"-","-","-",51,44.6,366.6,223.1,"-",0.12,13.5,0.5,7.68,7.7,4.5]
[null,null,null,null,null,null,null,null,null,null,null,null,null,null,null,"LIMON SABLEUX MCS-2",null,5400,5300,"-",130,520,"-","-","-","-",5.3,48.1,448.9,2592,1229,"-","-","-",85.5,74.8,614.5,374.1,"-",null,null,"-",5.3,48.1,448.9,2592,1229,"-","-","-",85.5,74.8,614.5,374.1,"-",0.31,36.1,1.33,21.09,19,11.4]
[null,null,null,null,null,null,null,null,null,null,null,null,null,null,null,"LIMON SABLEUX MCS-3",null,1500,1400,"-",37,140,"-","-","-","-",1.456,13.16,122.9,709.3,336.4,"-","-","-",23.4,20.49,168.2,102.4,"-",null,null,"-",1.456,13.16,122.9,709.3,336.4,"-","-","-",23.4,20.49,168.2,102.4,"-",9.9000000000000005E-2,1.1000000000000001,0.44500000000000001,6.68,6.2,3.8]
[null,null,null,null,null,null,null,null,null,null,null,null,null,null,null,"LIMON SABLEUX MCS-4",null,14000,13000,"-",340,1300,"-","-","-","-",13.78,125.1,1167,6739,3195,"-","-","-",222.3,194.5,1598,972.7,"-",null,null,"-",13.78,125.1,1167,6739,3195,"-","-","-",222.3,194.5,1598,972.7,"-",0.58499999999999996,69,2.65,40.200000000000003,36.25,22.5]
[null,null,null,null,null,null,null,null,null,null,null,null,null,null,null,"LIMON SABLEUX MCS-5",null,15000,14000,"-",370,1400,"-","-","-","-",14.85,133.69999999999999,1247,7202,3415,"-","-","-",237.6,207.9,1708,1040,"-",null,null,"-",14.85,133.69999999999999,1247,7202,3415,"-","-","-",237.6,207.9,1708,1040,"-",0.61,72.5,2.76,42,36,22.75]
[null,null,null,null,null,null,null,null,null,null,null,null,null,null,null,"LIMON SABLEUX MCS-6",null,20000,20000,"-",1000,20000,"-","-","-","-",360,3240,30240,174600,82800,"-","-","-",5760,5040,41400,25200,"-",null,null,"-",360,3240,30240,174600,82800,"-","-","-",5760,5040,41400,25200,"-",8.9,1200,40,3800,550,340]
[null,null,null,null,null,null,null,null,null,null,null,null,null,null,null,"LIMON SABLEUX MCS-7",null,20000,20000,"-",1000,20000,"-","-","-","-",360,3240,30240,174600,82800,"-","-","-",5760,5040,41400,25200,"-",null,null,"-",360,3240,30240,174600,82800,"-","-","-",5760,5040,41400,25200,"-",4.6500000000000004,550,20,290,290,160]
[null,null,null,null,null,null,null,null,null,null,null,null,null,null,null,"ARGILE MCS-1",null,9000,8700,"-",220,860,"-","-","-","-",8.8000000000000007,79.2,739.2,4268,2024,"-","-","-",140.80000000000001,123.2,1012,616,"-",null,null,"-",8.8000000000000007,79.2,739.2,4268,2024,"-","-","-",140.80000000000001,123.2,1012,616,"-",0.33,37.5,1.5,22,16,12]
[null,null,null,null,null,null,null,null,null,null,null,null,null,null,null,"ARGILE MCS-2",null,17000,16000,"-",420,1600,"-","-","-","-",16.8,151.30000000000001,1412,8154,3867,"-","-","-",269,235.4,1933,1177,"-",null,null,"-",16.8,151.30000000000001,1412,8154,3867,"-","-","-",269,235.4,1933,1177,"-",0.66,75,3,44,32,24]
[null,null,null,null,null,null,null,null,null,null,null,null,null,null,null,"ARGILE MCS-3",null,20000,5900,"-",140,580,"-","-","-","-",5.94,53.46,499,2881,1366,"-","-","-",95.04,83.16,683.1,415.8,"-",null,null,"-",5.94,53.46,499,2881,1366,"-","-","-",95.04,83.16,683.1,415.8,"-",0.22950000000000001,28,1.075,16.25,11.5,8.8000000000000007]
[null,null,null,null,null,null,null,null,null,null,null,null,null,null,null,"ARGILE MCS-4",null,20000,20000,"-",1000,4600,"-","-","-","-",47.08,423.7,3955,22830,10830,"-","-","-",753.3,659.1,5414,3296,"-",null,null,"-",47.08,423.7,3955,22830,10830,"-","-","-",753.3,659.1,5414,3296,"-",1.87,227,8.9049999999999994,132.5,95,75]
[null,null,null,null,null,null,null,null,null,null,null,null,null,null,null,"ARGILE MCS-5",null,20000,20000,"-",1000,4200,"-","-","-","-",43.56,392,3659,21130,10020,"-","-","-",697,609.79999999999995,5009,3049,"-",null,null,"-",43.56,392,3659,21130,10020,"-","-","-",697,609.79999999999995,5009,3049,"-",0.33,37.5,1.5,22,16,12]
[null,null,null,null,null,null,null,null,null,null,null,null,null,null,null,"ARGILE MCS-6",null,20000,20000,"-",1000,20000,"-","-","-","-",360,3240,30240,174600,82800,"-","-","-",5760,5040,41400,25200,"-",null,null,"-",360,3240,30240,174600,82800,"-","-","-",5760,5040,41400,25200,"-",31.5,6000,127.5,8000,1650,1050]
[null,null,null,null,null,null,null,null,null,null,null,null,null,null,null,"ARGILE MCS-7",null,20000,20000,"-",1000,20000,"-","-","-","-",360,3240,30240,174600,82800,"-","-","-",5760,5040,41400,25200,"-",null,null,"-",360,3240,30240,174600,82800,"-","-","-",5760,5040,41400,25200,"-",15.1,1725,60.3,875,819,490]
[null,null,null,null,null,null,null,null,null,null,null,null,null,null,null,"LIMON CAILLOUTEUX MCS-1",null,7800,7600,"-",190,740,"-","-","-","-",7.6,68.599999999999994,640.5,3698,1754,"-","-","-",122,106.8,876.9,533.79999999999995,"-",null,null,"-",7.6,68.599999999999994,640.5,3698,1754,"-","-","-",122,106.8,876.9,533.79999999999995,"-",0.28999999999999998,33.5,1.35,20,14,12]
[null,null,null,null,null,null,null,null,null,null,null,null,null,null,null,"LIMON CAILLOUTEUX MCS-2",null,14000,14000,"-",360,1400,"-","-","-","-",14.4,129.9,1213,7002,3321,"-","-","-",231,202.1,1660,1011,"-",null,null,"-",14.4,129.9,1213,7002,3321,"-","-","-",231,202.1,1660,1011,"-",0.48499999999999999,59.5,2.5,35,25,22.5]
[null,null,null,null,null,null,null,null,null,null,null,null,null,null,null,"LIMON CAILLOUTEUX MCS-3",null,3400,3300,"-",84,320,"-","-","-","-",3.3439999999999999,30.18,281.8,1627,771.8,"-","-","-",53.68,46.99,385.8,234.9,"-",null,null,"-",3.3439999999999999,30.18,281.8,1627,771.8,"-","-","-",53.68,46.99,385.8,234.9,"-",0.216,26.2,1.02,15,10.53,9]
[null,null,null,null,null,null,null,null,null,null,null,null,null,null,null,"LIMON CAILLOUTEUX MCS-4",null,2000,20000,"-",1000,4600,"-","-","-","-",36.49,328.4,3065,17690,8393,"-","-","-",583.79999999999995,510.8,4196,2554,"-",null,null,"-",36.49,328.4,3065,17690,8393,"-","-","-",583.79999999999995,510.8,4196,2554,"-",1.42,172.5,6.6619999999999999,102,68.5,59.5]
[null,null,null,null,null,null,null,null,null,null,null,null,null,null,null,"LIMON CAILLOUTEUX MCS-5",null,20000,20000,"-",1000,4200,"-","-","-","-",31.4,282.2,2635,15210,7214,"-","-","-",501.8,439.1,3607,2195,"-",null,null,"-",31.4,282.2,2635,15210,7214,"-","-","-",501.8,439.1,3607,2195,"-",1.2,147,5.75,87,57,49]
[null,null,null,null,null,null,null,null,null,null,null,null,null,null,null,"LIMON CAILLOUTEUX MCS-6",null,20000,20000,"-",1000,20000,"-","-","-","-",360,3240,30240,174600,82800,"-","-","-",5760,5040,41400,25200,"-",null,null,"-",360,3240,30240,174600,82800,"-","-","-",5760,5040,41400,25200,"-",23,6000,110,8000,1125,990]
[null,null,null,null,null,null,null,null,null,null,null,null,null,null,null,"LIMON CAILLOUTEUX MCS-7",null,20000,20000,"-",1000,20000,"-","-","-","-",360,3240,30240,174600,82800,"-","-","-",5760,5040,41400,25200,"-",null,null,"-",360,3240,30240,174600,82800,"-","-","-",5760,5040,41400,25200,"-",11.5,1400,55.75,800,570,493]
[null,null,null,null,null,null,null,null,null,null,null,null,null,null,null,"SABLE MCS-1",null,930,910,"-",23,90,"-","-","-","-",0.92,8.25,77,444.6,210.8,"-","-","-",14.67,12.83,105.4,64.17,"-",null,null,"-",0.92,8.25,77,444.6,210.8,"-","-","-",14.67,12.83,105.4,64.17,"-",0.05,6,0.22,3.5,2.1,2]
[null,null,null,null,null,null,null,null,null,null,null,null,null,null,null,"SABLE MCS-2",null,1600,1600,"-",41,160,"-","-","-","-",1.643,14.79,138,796.8,377.9,"-","-","-",26.29,23,188.9,115,"-",null,null,"-",1.643,14.79,138,796.8,377.9,"-","-","-",26.29,23,188.9,115,"-",0.1,12.5,0.45,6.9,4.5,4.4000000000000004]
[null,null,null,null,null,null,null,null,null,null,null,null,null,null,null,"SABLE MCS-3",null,790,770,"-",21,76,"-","-","-","-",0.77300000000000002,6.9459999999999997,65,375.3,178,"-","-","-",12.38,10.83,88.99,54.16,"-",null,null,"-",0.77300000000000002,6.9459999999999997,65,375.3,178,"-","-","-",12.38,10.83,88.99,54.16,"-",4.65E-2,5.55,0.21,3.15,2.0499999999999998,1.9]
[null,null,null,null,null,null,null,null,null,null,null,null,null,null,null,"SABLE MCS-4",null,6300,6200,"-",150,610,"-","-","-","-",6.2,56.1,523.70000000000005,3024,1434,"-","-","-",99.8,87.3,717,436.4,"-",null,null,"-",6.2,56.1,523.70000000000005,3024,1434,"-","-","-",99.8,87.3,717,436.4,"-",0.22500000000000001,28,1.1000000000000001,16.5,9.5,10]
[null,null,null,null,null,null,null,null,null,null,null,null,null,null,null,"SABLE MCS-5",null,9900,9700,"-",240,950,"-","-","-","-",9.75,87.75,819,4729,2243,"-","-","-",156,136.5,1121,682.5,"-",null,null,"-",9.75,87.75,819,4729,2243,"-","-","-",156,136.5,1121,682.5,"-",0.35499999999999998,44.5,1.55,25.5,14.5,14.5]
[null,null,null,null,null,null,null,null,null,null,null,null,null,null,null,"SABLE MCS-6",null,20000,20000,"-",900,3500,"-","-","-","-",36,324,3024,17460,8280,"-","-","-",576,504,4140,2520,"-",null,null,"-",36,{"$f":"AB120","v":324},3024,17460,8280,"-","-","-",576,504,4140,2520,"-",1.5,170,6,90,65,48]
[null,null,null,null,null,null,null,null,null,null,null,null,null,null,null,"SABLE MCS-7",null,22000,20000,"-",540,2200,"-","-","-","-",21.6,194.4,1914,10480,4968,"-","-","-",345.6,302.39999999999998,2484,1512,"-",null,null,{"$f":"Z121","v":"-"},{"$f":"AA121","v":21.6},194.4,1914,10480,4968,"-","-","-",345.6,302.39999999999998,2484,1512,"-",0.71,83,2.8,43,31.5,23.8]
[]
[]
[]
[null,null,null,null,null,null,null,null,null,null,null,null,null,null,"VSN (GRER v04 parti C)","usage",null,"conc. en mg/kg ms"]
[null,null,null,null,null,null,null,null,null,null,null,null,null,null,null,null,null,"Huile minérale \nEC5-35","Huile minérale \nEC10-40","Fraction\nEC 5-8","Fraction\nEC >8-10","Fraction\nEC >10-12","Fraction\nEC >12-16","Fraction\nEC >16-21","Fraction\nEC >21-35","ALI\nEC 5-6","ALI\nEC >6-8","ALI\nEC >8-10","ALI\nEC >10-12","ALI\nEC >12-16","ALI\nEC >16-21","ALI\nEC >21-35","Arom\nEC 6-7","Arom\nEC >7-8","Arom\nEC >8-10","Arom\nEC >10-12","Arom\nEC >12-16","Arom\nEC >16-21","Arom\nEC >21-35",null,null,"ALI\nEC 5-6","ALI\nEC >6-8","ALI\nEC >8-10","ALI\nEC >10-12","ALI\nEC >12-16","ALI\nEC >16-21","ALI\nEC >21-35","Arom\nEC 6-7","Arom\nEC >7-8","Arom\nEC >8-10","Arom\nEC >10-12","Arom\nEC >12-16","Arom\nEC >16-21","Arom\nEC >21-35","Benzène","Toluène","Ethylbenzène","Xylènes (somme)","MTBE","Naphtalène"]
[null,null,null,null,null,null,null,null,null,null,null,null,null,null,null,"I",null,null,null,6.2,211,884,8459,481309,1000000,null,null,null,null,null,null,null,null,null,null,null,null,null,null,null,null,{"$f":"Z127","v":0},0,0,0,0,0,0,0,0,0,0,0,0,0,0.2,9.1999999999999993,8,11,1.6,3.8]
[null,null,null,null,null,null,null,null,null,null,null,null,null,null,null,"II",null,null,null,5.8,169,679,6415,361909,1000000,null,null,null,null,null,null,null,null,null,null,null,null,null,null,null,null,0,0,0,0,0,0,0,0,0,0,0,0,0,0,0.2,7.8,6.4,8.9,1.5,2.9]
[null,null,null,null,null,null,null,null,null,null,null,null,null,null,null,"III",null,null,null,6,149,577,5393,302208,1000000,null,null,null,null,null,null,null,null,null,null,null,null,null,null,null,null,0,0,0,0,0,0,0,0,0,0,0,0,0,0,0.2,7.1,6,7.9,1.5,2.5]
[null,null,null,null,null,null,null,null,null,null,null,null,null,null,null,"IV",null,null,null,6,149,577,5393,302208,1000000,null,null,null,null,null,null,null,null,null,null,null,null,null,null,null,null,0,0,0,0,0,0,0,0,0,0,0,0,0,0,0.2,7.1,6,7.9,1.5,2.5]
[null,null,null,null,null,null,null,null,null,null,null,null,null,null,null,"V",null,null,null,10,601,2792,27541,1000000,1000000,null,null,null,null,null,null,null,null,null,null,null,null,null,null,null,null,0,0,0,0,0,0,0,0,0,0,0,0,0,0,0.21,22,23,30,2,12]
[]
[]
[]
[null,null,null,null,null,null,null,null,null,null,null,null,null,null,"VLN (GRER v04 parti C)","usage",null,"conc. en mg/kg ms"]
[null,null,null,null,null,null,null,null,null,null,null,null,null,null,null,null,null,"Huile minérale \nEC5-35","Huile minérale \nEC10-40","Fraction\nEC 5-8","Fraction\nEC >8-10","Fraction\nEC >10-12","Fraction\nEC >12-16","Fraction\nEC >16-21","Fraction\nEC >21-35","ALI\nEC 5-6","ALI\nEC >6-8","ALI\nEC >8-10","ALI\nEC >10-12","ALI\nEC >12-16","ALI\nEC >16-21","ALI\nEC >21-35","Arom\nEC 6-7","Arom\nEC >7-8","Arom\nEC >8-10","Arom\nEC >10-12","Arom\nEC >12-16","Arom\nEC >16-21","Arom\nEC >21-35",null,null,"ALI\nEC 5-6","ALI\nEC >6-8","ALI\nEC >8-10","ALI\nEC >10-12","ALI\nEC >12-16","ALI\nEC >16-21","ALI\nEC >21-35","Arom\nEC 6-7","Arom\nEC >7-8","Arom\nEC >8-10","Arom\nEC >10-12","Arom\nEC >12-16","Arom\nEC >16-21","Arom\nEC >21-35","Benzène","Toluène","Ethylbenzène","Xylènes (somme)","MTBE","Naphtalène"]
[null,null,null,null,null,null,null,null,null,null,null,null,null,null,null,"I",null,null,null,12.4,422,1768,16918,962618,1000000,null,null,null,null,null,null,null,null,null,null,null,null,null,null,null,null,{"$f":"Z137","v":0},0,0,0,0,0,0,0,0,0,0,0,0,0,1,77,41,48,6.59,26]
[null,null,null,null,null,null,null,null,null,null,null,null,null,null,null,"II",null,null,null,11.6,338,1358,12830,723818,1000000,null,null,null,null,null,null,null,null,null,null,null,null,null,null,null,null,0,0,0,0,0,0,0,0,0,0,0,0,0,0,1,65,32,39,6.18,20]
[null,null,null,null,null,null,null,null,null,null,null,null,null,null,null,"III",null,null,null,12,298,1154,10786,604416,1000000,null,null,null,null,null,null,null,null,null,null,null,null,null,null,null,null,0,0,0,0,0,0,0,0,0,0,0,0,0,0,1,59,30,34,6.18,17]
[null,null,null,null,null,null,null,null,null,null,null,null,null,null,null,"IV",null,null,null,12,298,1154,10786,604416,1000000,null,null,null,null,null,null,null,null,null,null,null,null,null,null,null,null,0,0,0,0,0,0,0,0,0,0,0,0,0,0,1,59,30,34,6.18,17]
[null,null,null,null,null,null,null,null,null,null,null,null,null,null,null,"V",null,null,null,20,1202,5584,55082,1000000,1000000,null,null,null,null,null,null,null,null,null,null,null,null,null,null,null,null,0,0,0,0,0,0,0,0,0,0,0,0,0,0,1,184,117,131,8.23,82]

{"sheet":"Eau Monitoring post-TA","index":13,"n_rows":42,"n_cols":47,"rows_kept":42,"cut":false,"hidden":false,"merged":[[24,1,24,17],[1,1,1,46],[2,2,2,46],[3,19,3,45],[4,20,4,25],[4,26,4,39],[4,18,4,19],[4,40,4,45],[3,1,4,6],[3,7,4,17],[3,46,5,46],[6,15,6,17],[8,15,8,17],[7,15,7,17],[9,1,9,17],[18,1,18,17]]}
[]
[null,"Perceptions de chantier et comparaison des résultats d'analyse (DS) pour le monitoring de l'eau souterraine après les travaux d'assainissement"]
[null,"Projet :",{"$f":"'Manuel d''utilisation'!C3","v":"BOF_SL_6000: Rue de la Station, 666 à 4308 Manage"}]
[null,"Identification du piézomètre",null,null,null,null,null,"Mesures de chantier",null,null,null,null,null,null,null,null,null,null,null,"Résultats d'analyse en µg/l",null,null,null,null,null,null,null,null,null,null,null,null,null,null,null,null,null,null,null,null,null,null,null,null,null,null,"Remarques (couleur, turbidité, limpidité, …)"]
[null,null,null,null,null,null,null,null,null,null,null,null,null,null,null,null,null,null,"HM somme",null,"Hydrocarbures pétroliers\n(fractions globales/combinées)",null,null,null,null,null,"Hydrocarbures pétroliers\n(analyse 'split' aliphatique/aromatique)",null,null,null,null,null,null,null,null,null,null,null,null,null,"BTEXN/MTBE"]
[null,"Parcelle cadastrale","Code du piézomètre","X (Lambert)","Y (Lambert)","Profondeur de l'ouvrage (cm-ns)(5)","Prof. de la crépine : de (cm-ns) à \n(cm-ns)","Date","Niveau d’eau par rapport au sommet du piézomètre (cm-ns)(1)","Quantité prélevée avant échantilllonnage (litre)","Piézomètre bien ou mal alimenté(4)","Zone de captage (I, IIa, IIb)(4)","Nappe exploitable ou non-exploitable(4)","Température (°C)","Ec (µS/cm)","Odeur : type(4)","Odeur : intensité(4)","pH","Huile minérale EC 5-35","Huile minérale EC 10-40","Fraction\nEC 5-8","Fraction\nEC 8-10","Fraction\nEC 10-12","Fraction\nEC 12-16","Fraction\nEC 16-21","Fraction\nEC 21-35","Ali\nEC 5-6","Ali\nEC 6-8","Ali\nEC 8-10","Ali\nEC 10-12","Ali\nEC 12-16","Ali\nEC 16-21","Ali\nEC 21-35","Aro\nEC 6-7","Aro\nEC 7-8","Aro\nEC 8-10","Aro\nEC 10-12","Aro\nEC 12-16","Aro\nEC 16-21","Aro\nEC 21-35","Benzène","Toluène","Ethylbenzène","Xylènes (total)","MTBE","Naphtalène"]
[null,"NORMES: Concentrations en gras et rouge si dépassement de la VSnappe",null,null,null,null,null,null,null,null,null,null,null,null,null,"VSnappe",null,null,null,null,60,200,200,200,300,300,null,null,null,null,null,null,null,null,null,null,null,null,null,null,10,700,300,500,300,60]
[null,"NORMES: Concentrations en souligné si dépassement des objectifs d'assainissement",null,null,null,null,null,null,null,null,null,null,null,null,null,"OA"]
[null,"NORMES:Concentrations en italique si dépassement de la valeur-limite de monitoring",null,null,null,null,null,null,null,null,null,null,null,null,null,"VL de monitoring"]
[null,"Source: "]
[null,"456e","P1",null,null,null,"200-400","2006-06-07",2.4,null,"bien","IIa","non défini",15,null,"DI"," +",6.27,null,null,61,null,null,null,null,null,null,null,null,null,null,null,null,null,null,null,null,null,null,null,null,68,2.5,9,40,-0.05]
[null,null,null,null,null,null,null,null,null,null,null,null,null,null,null,null,null,null,null,null,null,null,null,null,null,null,null,null,null,null,null,null,null,null,null,null,null,null,null,null,null,68,2.5,9,40,-0.05]
[null,null,null,null,null,null,null,null,null,null,null,null,null,null,null,null,null,null,null,null,null,null,null,null,null,null,null,null,null,null,null,null,null,null,null,null,null,null,null,null,null,68,2.5,9,40,-0.05]
[null,null,null,null,null,null,null,null,null,null,null,null,null,null,null,null,null,null,null,null,null,null,null,null,null,null,null,null,null,null,null,null,null,null,null,null,null,null,null,null,null,68,2.5,9,40,-0.05]
[null,null,null,null,null,null,null,null,null,null,null,null,null,null,null,null,null,null,null,null,null,null,null,null,null,null,null,null,null,null,null,null,null,null,null,null,null,null,null,null,null,68,2.5,9,40,-0.05]
[null,null,null,null,null,null,null,null,null,null,null,null,null,null,null,null,null,null,null,null,null,null,null,null,null,null,null,null,null,null,null,null,null,null,null,null,null,null,null,null,null,68,2.5,9,40,-0.05]
[null,null,null,null,null,null,null,null,null,null,null,null,null,null,null,null,null,null,null,null,null,null,null,null,null,null,null,null,null,null,null,null,null,null,null,null,null,null,null,null,null,68,2.5,9,40,-0.05]
[null,null,null,null,null,null,null,null,null,null,null,null,null,null,null,null,null,null,null,null,null,null,null,null,null,null,null,null,null,null,null,null,null,null,null,null,null,null,null,null,null,68,2.5,9,40,-0.05]
[null,"Amont:"]
[]
[]
[]
[]
[]
[null,"Aval:"]
[]
[]
[]
[]
[]
[null,"Légende"]
[]
[null,"(1) S'il y a une couche surnageante, il convient d'en mentionner les parties supérieure et inférieure"]
[null,"(3) A adapter conformément à la législation et aux paramètres spécifiques au site"]
[null,"(4) Liste déroulante"]
[null,"(5) Si différente de la profondeur de la base de la crépine"]
[null,null,null,null,null,null,null,null,null,"data validation"]
[null,null,null,null,null,null,null,null,null,null,"bien","I","Exploit.",null,null,"Ess"," -"]
[null,null,null,null,null,null,null,null,null,null,"mal","IIa","Non Expl.",null,null,"DI"," +"]
[null,null,null,null,null,null,null,null,null,null,"insuffisam.","IIb","non défini",null,null,"HA"," ++"]
[null,null,null,null,null,null,null,null,null,null,"non défini","hors zone",null,null,null,"MC"]
[null,null,null,null,null,null,null,null,null,null,null,null,null,null,null,"AU"]

{"sheet":"Histlog","index":14,"n_rows":10,"n_cols":5,"rows_kept":10,"cut":false,"hidden":true,"merged":[]}
["versie","naam","goedgekeurd ","datum","opmerking"]
["2.0","LV","EG","2020-04-06","version 2.0 définitive BOFAS 3"]
[null,"YVM",null,"2020-03-30","histlog complété"]
["1.3","YV",null,"2020-03-27","Dernières corrections avant lay-out BOFAS 3"]
["1.2","YVM",null,"2020-03-25","Conditional formatting, perméabilité (2 unités), "]
["1.1","YV",null,"2020-03-23","Adaptation BOF-SRA, formules granulométrie, ajout hydrogéologie"]
[1,"GM","EG","2019-09-27","Version définitive BOFAS 3"]
["0.3","LV",null,"2019-09-13","referenties rechtzetten ism yvon + pagina-uitlijning"]
[0.2,"TL",null,"2019-09-12","traducation"]
["0.1","LV",null,"2019-09-11","lay-out BOFAS 3 + nazicht referenties"]